{"text_format":"2","workbook":"xlsx","n_sheets":14,"sheets":["Titelblatt","Info","Offertöffnung","Formell","Eignung","Kosten","Zuschlag","Zuschlag-Diagramm","Bemerkungen Zuschlag","Gesamt","Antrag","Auswertungstabelle","Aufbereitung Diagramm","Daten"],"not_rendered":{"charts":2,"images":2,"macros":0,"external_links":0,"defined_names":19,"comments":0,"pivot_tables":0},"unopened":[{"sheet":"Zuschlag-Diagramm","index":7,"reason":"not_a_worksheet"}],"bounds":{"document_bytes":16777216,"sheet_cells":100000,"run_cost":"one","rows_first":2000,"rows_last":500,"rows_between":2000,"halvings":0,"cell_chars":16384,"cell_head_chars":4096},"cells_cut":0,"cells_raw":0,"read":"whole","date_system":"1900"}

{"sheet":"Titelblatt","index":0,"n_rows":48,"n_cols":26,"rows_kept":48,"cut":false,"hidden":false,"merged":[[19,6,23,25],[25,6,29,25],[0,0,6,0]]}
[{"$f":"Daten!A10","v":"Kopfzeile bearbeiten"},{"$nulls":19},"Koordinationskonferenz der Bau- und Liegenschaftsorgane der öffentlichen Bauherren"]
[{"$nulls":20},"Conférence de coordination des services de la construction et des immeubles des"]
[{"$nulls":20},"maîtres d’ouvrage publics"]
[{"$nulls":20},"Conferenza di coordinamento degli organi della costruzione e degli immobili dei "]
[{"$nulls":20},"committenti pubblici"]
[{"$nulls":20},"Coordination Conference for Public Sector Construction and Property Services"]
{"$rows_empty":7}
[{"$nulls":6},{"$f":"Daten!A79","v":"Vergabeantrag"}]
[]
[]
[]
[]
[]
[{"$nulls":6},{"$f":"Info!K4","v":0}]
[]
[]
[]
[]
[]
[{"$nulls":6},{"$f":"Info!K11","v":0}]
{"$rows_empty":11}
[{"$nulls":6},{"$f":"Daten!A26&\":\"","v":"Projektleiter:"},{"$nulls":6},{"$f":"IF(Info!D13=\"\",\"\",Info!D13)","v":""}]
[]
[{"$nulls":6},{"$f":"Daten!A41&\":\"","v":"Organisationseinheit:"},{"$nulls":6},{"$f":"IF(Info!D15=\"\",\"\",Info!D15)","v":""}]
[]
[]
[]
[]
[]
[]
[null,"Copyright 2023 KBOB",{"$nulls":4},{"$f":"Daten!A174&\" 46\"","v":"KBOB-Dokument Nr. 46"},{"$nulls":6},{"$f":"Daten!A79","v":"Vergabeantrag"},{"$nulls":11},{"$f":"TODAY()","v":"2024-12-02"}]
[null,{"$f":"Daten!A175","v":"Version"},"2023 (3.0)",null,null,null,"[Version HOCH 3.3]"]

{"sheet":"Info","index":1,"n_rows":30,"n_cols":21,"rows_kept":30,"cut":false,"hidden":false,"merged":[[25,3,25,5],[27,3,27,5],[21,10,21,12],[3,3,3,5],[10,3,10,5],[12,3,12,5],[14,3,14,5],[7,15,7,19],[10,15,14,19],[19,10,19,12],[3,10,8,12],[10,10,15,12]]}
[{"$nulls":15},"v12.2"]
[{"$f":"Daten!A29","v":"Projektinformationen"},{"$nulls":14},{"$f":"Daten!A12","v":"Informationen zum Ausfüllen des Formulars (wird nicht gedruckt)"}]
[]
[{"$f":"Daten!A37&\":\"","v":"Projektnummer:"},{"$nulls":6},{"$f":"Daten!A38&\":\"","v":"Projektbezeichnung:"},{"$nulls":7},"deutsch","Sprache / Langue / Lingua"]
[]
[]
[]
[{"$nulls":15},"Bearbeitbare Zellen im Dokument kennzeichnen",{"$nulls":4},{"$f":"IF(OR(Zellmarkierung=Daten!C13,Zellmarkierung=Daten!D13,Zellmarkierung=Daten!E13),1,2)","v":1}]
[]
[]
[{"$f":"Daten!A39&\":\"","v":"Auftragsnummer:"},{"$nulls":6},{"$f":"Daten!A40&\":\"","v":"Vertragsgegenstand:"},{"$nulls":7},{"$f":"IF(P8=Daten!A13,Daten!A15,Daten!A16)","v":"Die bearbeitbaren Zellen werden hellgrau gekennzeichnet, damit klar ersichtlich ist, wo gegebenenfalls Eingaben zu machen sind."}]
[]
[{"$f":"Daten!A43&\":\"","v":"Projektleiter Bauherr:"}]
[]
[{"$f":"Daten!A41&\":\"","v":"Organisationseinheit:"}]
[]
[]
[{"$f":"Daten!A42&\":\"","v":"Vertragsbeginn / -ende:"},{"$nulls":6},{"$f":"Daten!A46&\":\"","v":"Vertragspartner:"},null,null,{"$f":"IF(Antrag!D32=\"\",\"\",Antrag!D32&\" / \"&Antrag!D36)","v":""}]
[]
[{"$nulls":7},{"$f":"Daten!A72&\":\"","v":"Kreditorennummer:"}]
[]
[{"$f":"Daten!A71&\":\"","v":"Zahlungsbedingungen (Tage/Skonto):"},null,null,null,{"$f":"Daten!A70","v":"Tage"},null,null,{"$f":"Daten!A44&\":\"","v":"Verfasser Ausschreibung:"}]
[]
[{"$f":"Daten!A48","v":"Vergabeverfahren"}]
[]
[{"$f":"Daten!A48&\":\"","v":"Vergabeverfahren:"},{"$nulls":6},{"$f":"Daten!A49&\":\"","v":"Datum Ausschreibung:"}]
[]
[{"$f":"Daten!A51&\":\"","v":"Begründung für freihändiges Verfahren:"},{"$nulls":6},{"$f":"Daten!A50&\":\"","v":"Eingabedatum Angebot:"}]
[]
[{"$f":"Daten!A69","v":"Bemerkungen"}]

{"sheet":"Offertöffnung","index":2,"n_rows":39,"n_cols":16,"rows_kept":39,"cut":false,"hidden":false,"merged":[[11,9,11,10],[13,9,13,12],[15,10,15,11],[16,10,16,11],[15,15,16,19]]}
[]
[{"$f":"Daten!A31","v":"Offertöffnungsprotokoll"}]
[]
[{"$f":"Daten!A37&\":\"","v":"Projektnummer:"},null,null,{"$f":"CELL(\"inhalt\",Info!D4:F4)","v":0}]
[]
[{"$f":"Daten!A38&\":\"","v":"Projektbezeichnung:"},null,null,{"$f":"CELL(\"inhalt\",Info!K4:M8)","v":0}]
[]
[{"$f":"Daten!A40&\":\"","v":"Vertragsgegenstand:"},null,null,{"$f":"CELL(\"inhalt\",Info!K11:M15)","v":0}]
[]
[{"$f":"Daten!A48&\":\"","v":"Vergabeverfahren:"},null,null,{"$f":"CELL(\"inhalt\",Info!D26:F26)","v":0}]
[]
[{"$f":"Daten!A50&\":\"","v":"Eingabedatum Angebot:"},null,null,{"$f":"IF(Info!K28=\"\",\"\",Info!K28)","v":""},null,null,{"$f":"Daten!A88&\":\"","v":"Datum der Offertöffnung:"}]
[]
[{"$f":"Daten!A43&\":\"","v":"Projektleiter Bauherr:"},null,null,{"$f":"CELL(\"inhalt\",Info!D13:F13)","v":0},null,null,{"$f":"Daten!A89&\":\"","v":"Anwesende Vertreter des Bauherrn:"}]
[]
[{"$f":"Daten!A90","v":"Nr."},{"$f":"Daten!A98","v":"Unbedingt ausfüllen!"},null,{"$f":"Daten!A91","v":"Anbieter / ARGE / INGE"},null,null,null,{"$f":"Daten!A100","v":"Datum Eingabe"},{"$f":"Daten!A102","v":"Eingabe brutto"},{"$f":"Daten!A104","v":"Ra-batt"},{"$f":"Daten!A105","v":"Skonto"},null,{"$f":"Daten!A107","v":"Bemerkungen"},null,null,{"$f":"Daten!A21","v":"Die Spalte \"Kurzbezeichnung Firma\" muss unbedingt ausgefüllt werden, da diese Bezeichnung der Firma in allen weiteren Blättern verwerndet wird."}]
[null,{"$f":"Daten!A99","v":"Kurzbe-zeichnung Firma"},{"$f":"Daten!A92","v":"Bezeichnung"},{"$f":"Daten!A93","v":"Strasse / Nr."},{"$f":"Daten!A95","v":"PLZ"},{"$f":"Daten!A96","v":"Ort"},{"$f":"Daten!A97","v":"Name Verantw. Offerte"},{"$f":"Daten!A101","v":"(Poststempel, Eingangs-stempel)"},{"$f":"Daten!A103","v":"CHF\n(ohne Rabatt, \nMWST und Skonto)"},"%",{"$f":"Daten!A106","v":"% / Tage"},null,{"$f":"Daten!A108","v":"z.B. Variantenbezeichnung"}]
[1]
[2]
[3]
[4]
[5]
[6]
[7]
[8]
[9]
[10]
[11]
[12]
[13]
[14]
[15]
[16]
[17]
[18]
[19]
[20]
[]
[{"$f":"Daten!A109","v":"Ort, Datum und Unterschriften"}]

{"sheet":"Formell","index":3,"n_rows":36,"n_cols":25,"rows_kept":36,"cut":false,"hidden":false,"merged":[[33,2,33,21],[31,2,31,21],[9,2,9,21],[12,24,17,28],[23,2,23,21],[25,2,25,21],[27,2,27,21],[29,2,29,21]]}
[]
[{"$f":"Daten!A32","v":"Formelle Prüfung"}]
[]
[{"$f":"Daten!A37&\":\"","v":"Projektnummer:"},null,{"$f":"CELL(\"inhalt\",Info!D4:F4)","v":0}]
[]
[{"$f":"Daten!A38&\":\"","v":"Projektbezeichnung:"},null,{"$f":"CELL(\"inhalt\",Info!K4:M8)","v":0}]
[]
[{"$f":"Daten!A40&\":\"","v":"Vertragsgegenstand:"},null,{"$f":"CELL(\"inhalt\",Info!K11:M15)","v":0}]
[]
[null,null,{"$f":"Daten!A113","v":"Anbieter (Nr. gemäss Offertöffnungprotokoll)"}]
[null,null,1,2,3,4,5,6,7,8,9,10,11,12,13,14,15,16,17,18,19,20]
[{"$f":"Daten!A90","v":"Nr."},{"$f":"Daten!A112","v":"Wesentliche Formfehler"},{"$f":"Auswertungstabelle!C3","v":""},{"$f":"Auswertungstabelle!D3","v":""},{"$f":"Auswertungstabelle!E3","v":""},{"$f":"Auswertungstabelle!F3","v":""},{"$f":"Auswertungstabelle!G3","v":""},{"$f":"Auswertungstabelle!H3","v":""},{"$f":"Auswertungstabelle!I3","v":""},{"$f":"Auswertungstabelle!J3","v":""},{"$f":"Auswertungstabelle!K3","v":""},{"$f":"Auswertungstabelle!L3","v":""},{"$f":"Auswertungstabelle!M3","v":""},{"$f":"Auswertungstabelle!N3","v":""},{"$f":"Auswertungstabelle!O3","v":""},{"$f":"Auswertungstabelle!P3","v":""},{"$f":"Auswertungstabelle!Q3","v":""},{"$f":"Auswertungstabelle!R3","v":""},{"$f":"Auswertungstabelle!S3","v":""},{"$f":"Auswertungstabelle!T3","v":""},{"$f":"Auswertungstabelle!U3","v":""},{"$f":"Auswertungstabelle!V3","v":""}]
[1,{"$f":"Daten!A114","v":"Das Angebot wurde rechtzeitig eingereicht \n(siehe Offertöffnungsprotokoll)"},"√","√","√","√","√","√","√","√","√","√","√","√","√","√","√","√","√","√","√","√",null,null,{"$f":"Daten!A19","v":"Die Kriterien sind mit √ (ja) oder X (nein) zu bewerten. \n\nDie Kriterien können mittels Dropdownmenü ausgewählt werden.\n\nUm eine Eingabe zu löschen, einfach das Feld markieren und \"Delete\" drücken.\n\nFalls ein Anbieter als Bewertung ein X erhält, wird er von der weiteren Bewertung ausgeschlossen!"}]
[2,{"$f":"Daten!A115","v":"Es gibt keine unerlaubte Veränderung (z.B. Streichung, Ergänzung etc.) der Angebotsunterlagen"},"√","√","√","√","√","√","√","√","√","√","√","√","√","√","√","√","√","√","√","√"]
[3,{"$f":"Daten!A116","v":"Es gibt keine unerlaubte Veränderung (z.B. Streichung, Ergänzung etc.) des Vertragsentwurfs"},"√","√","√","√","√","√","√","√","√","√","√","√","√","√","√","√","√","√","√","√"]
[4,{"$f":"Daten!A117","v":"Es wurden alle im Pflichtenheft verlangten Unterlagen eingereicht"},"√","√","√","√","√","√","√","√","√","√","√","√","√","√","√","√","√","√","√","√"]
[5,{"$f":"Daten!A118","v":"Es gibt keine unerlaubten Vorbehalte zum Angebot "},"√","√","√","√","√","√","√","√","√","√","√","√","√","√","√","√","√","√","√","√"]
[6,"Lohngleichheitsanalyse ab 100 Mitarbeitenden wurde eingereicht","√","√","√","√","√","√","√","√","√","√","√","√","√","√","√","√","√","√","√","√"]
[{"$f":"Daten!A119","v":"Weiterbearbeitung (ja/nein)"},null,{"$f":"IF(OR(C13=\"X\",C14=\"X\",C15=\"X\",C16=\"X\",C17=\"X\",C18=\"X\"),Daten!$A24,Daten!$A23)","v":"ja"},{"$f":"IF(OR(D13=\"X\",D14=\"X\",D15=\"X\",D16=\"X\",D17=\"X\",D18=\"X\"),Daten!$A24,Daten!$A23)","v":"ja"},{"$f":"IF(OR(E13=\"X\",E14=\"X\",E15=\"X\",E16=\"X\",E17=\"X\",E18=\"X\"),Daten!$A24,Daten!$A23)","v":"ja"},{"$f":"IF(OR(F13=\"X\",F14=\"X\",F15=\"X\",F16=\"X\",F17=\"X\",F18=\"X\"),Daten!$A24,Daten!$A23)","v":"ja"},{"$f":"IF(OR(G13=\"X\",G14=\"X\",G15=\"X\",G16=\"X\",G17=\"X\",G18=\"X\"),Daten!$A24,Daten!$A23)","v":"ja"},{"$f":"IF(OR(H13=\"X\",H14=\"X\",H15=\"X\",H16=\"X\",H17=\"X\",H18=\"X\"),Daten!$A24,Daten!$A23)","v":"ja"},{"$f":"IF(OR(I13=\"X\",I14=\"X\",I15=\"X\",I16=\"X\",I17=\"X\",I18=\"X\"),Daten!$A24,Daten!$A23)","v":"ja"},{"$f":"IF(OR(J13=\"X\",J14=\"X\",J15=\"X\",J16=\"X\",J17=\"X\",J18=\"X\"),Daten!$A24,Daten!$A23)","v":"ja"},{"$f":"IF(OR(K13=\"X\",K14=\"X\",K15=\"X\",K16=\"X\",K17=\"X\",K18=\"X\"),Daten!$A24,Daten!$A23)","v":"ja"},{"$f":"IF(OR(L13=\"X\",L14=\"X\",L15=\"X\",L16=\"X\",L17=\"X\",L18=\"X\"),Daten!$A24,Daten!$A23)","v":"ja"},{"$f":"IF(OR(M13=\"X\",M14=\"X\",M15=\"X\",M16=\"X\",M17=\"X\",M18=\"X\"),Daten!$A24,Daten!$A23)","v":"ja"},{"$f":"IF(OR(N13=\"X\",N14=\"X\",N15=\"X\",N16=\"X\",N17=\"X\",N18=\"X\"),Daten!$A24,Daten!$A23)","v":"ja"},{"$f":"IF(OR(O13=\"X\",O14=\"X\",O15=\"X\",O16=\"X\",O17=\"X\",O18=\"X\"),Daten!$A24,Daten!$A23)","v":"ja"},{"$f":"IF(OR(P13=\"X\",P14=\"X\",P15=\"X\",P16=\"X\",P17=\"X\",P18=\"X\"),Daten!$A24,Daten!$A23)","v":"ja"},{"$f":"IF(OR(Q13=\"X\",Q14=\"X\",Q15=\"X\",Q16=\"X\",Q17=\"X\",Q18=\"X\"),Daten!$A24,Daten!$A23)","v":"ja"},{"$f":"IF(OR(R13=\"X\",R14=\"X\",R15=\"X\",R16=\"X\",R17=\"X\",R18=\"X\"),Daten!$A24,Daten!$A23)","v":"ja"},{"$f":"IF(OR(S13=\"X\",S14=\"X\",S15=\"X\",S16=\"X\",S17=\"X\",S18=\"X\"),Daten!$A24,Daten!$A23)","v":"ja"},{"$f":"IF(OR(T13=\"X\",T14=\"X\",T15=\"X\",T16=\"X\",T17=\"X\",T18=\"X\"),Daten!$A24,Daten!$A23)","v":"ja"},{"$f":"IF(OR(U13=\"X\",U14=\"X\",U15=\"X\",U16=\"X\",U17=\"X\",U18=\"X\"),Daten!$A24,Daten!$A23)","v":"ja"},{"$f":"IF(OR(V13=\"X\",V14=\"X\",V15=\"X\",V16=\"X\",V17=\"X\",V18=\"X\"),Daten!$A24,Daten!$A23)","v":"ja"}]
[]
[{"$f":"Daten!A120","v":"Bemerkungen zur Bewertung"}]
[{"$f":"Daten!A90","v":"Nr."},{"$f":"Daten!A121","v":"Anbieter"},{"$f":"Daten!A122","v":"Begründung"}]
[]
[null,{"$f":"IF(A24=\"\",\"\",HLOOKUP(A24,$C$11:$V$12,2))","v":""}]
[]
[null,{"$f":"IF(A26=\"\",\"\",HLOOKUP(A26,$C$11:$V$12,2))","v":""}]
[]
[null,{"$f":"IF(A28=\"\",\"\",HLOOKUP(A28,$C$11:$V$12,2))","v":""}]
[]
[null,{"$f":"IF(A30=\"\",\"\",HLOOKUP(A30,$C$11:$V$12,2))","v":""}]
[]
[null,{"$f":"IF(A32=\"\",\"\",HLOOKUP(A32,$C$11:$V$12,2))","v":""}]
[]
[null,{"$f":"IF(A34=\"\",\"\",HLOOKUP(A34,$C$11:$V$12,2))","v":""}]
[]
["↑",{"$f":"Daten!A113","v":"Anbieter (Nr. gemäss Offertöffnungprotokoll)"}]

{"sheet":"Eignung","index":4,"n_rows":36,"n_cols":25,"rows_kept":36,"cut":false,"hidden":false,"merged":[[31,2,31,21],[33,2,33,21],[9,2,9,21],[13,24,17,28],[23,2,23,21],[25,2,25,21],[27,2,27,21],[29,2,29,21]]}
[]
[{"$f":"Daten!A33","v":"Eignungsprüfung"}]
[]
[{"$f":"Daten!A37&\":\"","v":"Projektnummer:"},null,{"$f":"CELL(\"inhalt\",Info!D4:F4)","v":0}]
[]
[{"$f":"Daten!A38&\":\"","v":"Projektbezeichnung:"},null,{"$f":"CELL(\"inhalt\",Info!K4:M8)","v":0}]
[]
[{"$f":"Daten!A40&\":\"","v":"Vertragsgegenstand:"},null,{"$f":"CELL(\"inhalt\",Info!K11:M15)","v":0}]
[]
[null,null,{"$f":"Daten!A113","v":"Anbieter (Nr. gemäss Offertöffnungprotokoll)"}]
[null,null,1,2,3,4,5,6,7,8,9,10,11,12,13,14,15,16,17,18,19,20]
[null,{"$f":"Daten!A124","v":"Eignungskriterien\n(gemäss Ausschreibung)"},{"$f":"Auswertungstabelle!C3","v":""},{"$f":"Auswertungstabelle!D3","v":""},{"$f":"Auswertungstabelle!E3","v":""},{"$f":"Auswertungstabelle!F3","v":""},{"$f":"Auswertungstabelle!G3","v":""},{"$f":"Auswertungstabelle!H3","v":""},{"$f":"Auswertungstabelle!I3","v":""},{"$f":"Auswertungstabelle!J3","v":""},{"$f":"Auswertungstabelle!K3","v":""},{"$f":"Auswertungstabelle!L3","v":""},{"$f":"Auswertungstabelle!M3","v":""},{"$f":"Auswertungstabelle!N3","v":""},{"$f":"Auswertungstabelle!O3","v":""},{"$f":"Auswertungstabelle!P3","v":""},{"$f":"Auswertungstabelle!Q3","v":""},{"$f":"Auswertungstabelle!R3","v":""},{"$f":"Auswertungstabelle!S3","v":""},{"$f":"Auswertungstabelle!T3","v":""},{"$f":"Auswertungstabelle!U3","v":""},{"$f":"Auswertungstabelle!V3","v":""}]
[{"$f":"Daten!A90","v":"Nr."},null,{"$f":"IF(Formell!C19=Daten!$A24,Daten!$A28,\"\")","v":""},{"$f":"IF(Formell!D19=Daten!$A24,Daten!$A28,\"\")","v":""},{"$f":"IF(Formell!E19=Daten!$A24,Daten!$A28,\"\")","v":""},{"$f":"IF(Formell!F19=Daten!$A24,Daten!$A28,\"\")","v":""},{"$f":"IF(Formell!G19=Daten!$A24,Daten!$A28,\"\")","v":""},{"$f":"IF(Formell!H19=Daten!$A24,Daten!$A28,\"\")","v":""},{"$f":"IF(Formell!I19=Daten!$A24,Daten!$A28,\"\")","v":""},{"$f":"IF(Formell!J19=Daten!$A24,Daten!$A28,\"\")","v":""},{"$f":"IF(Formell!K19=Daten!$A24,Daten!$A28,\"\")","v":""},{"$f":"IF(Formell!L19=Daten!$A24,Daten!$A28,\"\")","v":""},{"$f":"IF(Formell!M19=Daten!$A24,Daten!$A28,\"\")","v":""},{"$f":"IF(Formell!N19=Daten!$A24,Daten!$A28,\"\")","v":""},{"$f":"IF(Formell!O19=Daten!$A24,Daten!$A28,\"\")","v":""},{"$f":"IF(Formell!P19=Daten!$A24,Daten!$A28,\"\")","v":""},{"$f":"IF(Formell!Q19=Daten!$A24,Daten!$A28,\"\")","v":""},{"$f":"IF(Formell!R19=Daten!$A24,Daten!$A28,\"\")","v":""},{"$f":"IF(Formell!S19=Daten!$A24,Daten!$A28,\"\")","v":""},{"$f":"IF(Formell!T19=Daten!$A24,Daten!$A28,\"\")","v":""},{"$f":"IF(Formell!U19=Daten!$A24,Daten!$A28,\"\")","v":""},{"$f":"IF(Formell!V19=Daten!$A24,Daten!$A28,\"\")","v":""}]
[1,"Angabe von zwei mit der Aufgabe vergleichbaren Referenzobjekten (Teil B, KBOB Doc 13, Formular 3)","√","√","√","√","√","√","√","√","√","√","√","√","√","√","√","√","√","√","√","√",null,null,{"$f":"Daten!A19","v":"Die Kriterien sind mit √ (ja) oder X (nein) zu bewerten. \n\nDie Kriterien können mittels Dropdownmenü ausgewählt werden.\n\nUm eine Eingabe zu löschen, einfach das Feld markieren und \"Delete\" drücken.\n\nFalls ein Anbieter als Bewertung ein X erhält, wird er von der weiteren Bewertung ausgeschlossen!"}]
[2,"Nachweis der personellen Ressourcen (Teil B, KBOB Doc. 13, Formular 1)","√","√","√","√","√","√","√","√","√","√","√","√","√","√","√","√","√","√","√","√"]
[3,"Erklärung über den Umsatz der letzten 3 jahre (Teil B, KBOB Doc 13, Formular 1)","√","√","√","√","√","√","√","√","√","√","√","√","√","√","√","√","√","√","√","√"]
[4,"Nachweis der wirtschaftlichen Leistungsfähigkeit: Auszug Handels-, Betreibungsregister","√","√","√","√","√","√","√","√","√","√","√","√","√","√","√","√","√","√","√","√"]
[5,"Versicherungsnachweis","√","√","√","√","√","√","√","√","√","√","√","√","√","√","√","√","√","√","√","√"]
[{"$f":"Daten!A126","v":"Eignungskriterien erfüllt (ja/nein)"},null,{"$f":"IF(C13=Daten!$A28,Daten!$A24,IF(OR(C14=\"X\",C15=\"X\",C16=\"X\",C17=\"X\",C18=\"X\"),Daten!$A24,Daten!$A23))","v":"ja"},{"$f":"IF(D13=Daten!$A28,Daten!$A24,IF(OR(D14=\"X\",D15=\"X\",D16=\"X\",D17=\"X\",D18=\"X\"),Daten!$A24,Daten!$A23))","v":"ja"},{"$f":"IF(E13=Daten!$A28,Daten!$A24,IF(OR(E14=\"X\",E15=\"X\",E16=\"X\",E17=\"X\",E18=\"X\"),Daten!$A24,Daten!$A23))","v":"ja"},{"$f":"IF(F13=Daten!$A28,Daten!$A24,IF(OR(F14=\"X\",F15=\"X\",F16=\"X\",F17=\"X\",F18=\"X\"),Daten!$A24,Daten!$A23))","v":"ja"},{"$f":"IF(G13=Daten!$A28,Daten!$A24,IF(OR(G14=\"X\",G15=\"X\",G16=\"X\",G17=\"X\",G18=\"X\"),Daten!$A24,Daten!$A23))","v":"ja"},{"$f":"IF(H13=Daten!$A28,Daten!$A24,IF(OR(H14=\"X\",H15=\"X\",H16=\"X\",H17=\"X\",H18=\"X\"),Daten!$A24,Daten!$A23))","v":"ja"},{"$f":"IF(I13=Daten!$A28,Daten!$A24,IF(OR(I14=\"X\",I15=\"X\",I16=\"X\",I17=\"X\",I18=\"X\"),Daten!$A24,Daten!$A23))","v":"ja"},{"$f":"IF(J13=Daten!$A28,Daten!$A24,IF(OR(J14=\"X\",J15=\"X\",J16=\"X\",J17=\"X\",J18=\"X\"),Daten!$A24,Daten!$A23))","v":"ja"},{"$f":"IF(K13=Daten!$A28,Daten!$A24,IF(OR(K14=\"X\",K15=\"X\",K16=\"X\",K17=\"X\",K18=\"X\"),Daten!$A24,Daten!$A23))","v":"ja"},{"$f":"IF(L13=Daten!$A28,Daten!$A24,IF(OR(L14=\"X\",L15=\"X\",L16=\"X\",L17=\"X\",L18=\"X\"),Daten!$A24,Daten!$A23))","v":"ja"},{"$f":"IF(M13=Daten!$A28,Daten!$A24,IF(OR(M14=\"X\",M15=\"X\",M16=\"X\",M17=\"X\",M18=\"X\"),Daten!$A24,Daten!$A23))","v":"ja"},{"$f":"IF(N13=Daten!$A28,Daten!$A24,IF(OR(N14=\"X\",N15=\"X\",N16=\"X\",N17=\"X\",N18=\"X\"),Daten!$A24,Daten!$A23))","v":"ja"},{"$f":"IF(O13=Daten!$A28,Daten!$A24,IF(OR(O14=\"X\",O15=\"X\",O16=\"X\",O17=\"X\",O18=\"X\"),Daten!$A24,Daten!$A23))","v":"ja"},{"$f":"IF(P13=Daten!$A28,Daten!$A24,IF(OR(P14=\"X\",P15=\"X\",P16=\"X\",P17=\"X\",P18=\"X\"),Daten!$A24,Daten!$A23))","v":"ja"},{"$f":"IF(Q13=Daten!$A28,Daten!$A24,IF(OR(Q14=\"X\",Q15=\"X\",Q16=\"X\",Q17=\"X\",Q18=\"X\"),Daten!$A24,Daten!$A23))","v":"ja"},{"$f":"IF(R13=Daten!$A28,Daten!$A24,IF(OR(R14=\"X\",R15=\"X\",R16=\"X\",R17=\"X\",R18=\"X\"),Daten!$A24,Daten!$A23))","v":"ja"},{"$f":"IF(S13=Daten!$A28,Daten!$A24,IF(OR(S14=\"X\",S15=\"X\",S16=\"X\",S17=\"X\",S18=\"X\"),Daten!$A24,Daten!$A23))","v":"ja"},{"$f":"IF(T13=Daten!$A28,Daten!$A24,IF(OR(T14=\"X\",T15=\"X\",T16=\"X\",T17=\"X\",T18=\"X\"),Daten!$A24,Daten!$A23))","v":"ja"},{"$f":"IF(U13=Daten!$A28,Daten!$A24,IF(OR(U14=\"X\",U15=\"X\",U16=\"X\",U17=\"X\",U18=\"X\"),Daten!$A24,Daten!$A23))","v":"ja"},{"$f":"IF(V13=Daten!$A28,Daten!$A24,IF(OR(V14=\"X\",V15=\"X\",V16=\"X\",V17=\"X\",V18=\"X\"),Daten!$A24,Daten!$A23))","v":"ja"}]
[]
[{"$f":"Daten!A120","v":"Bemerkungen zur Bewertung"}]
[{"$f":"Daten!A90","v":"Nr."},{"$f":"Daten!A121","v":"Anbieter"},{"$f":"Daten!A122","v":"Begründung"}]
[]
[null,{"$f":"IF(A24=\"\",\"\",HLOOKUP(A24,$C$11:$V$12,2))","v":""}]
[]
[null,{"$f":"IF(A26=\"\",\"\",HLOOKUP(A26,$C$11:$V$12,2))","v":""}]
[]
[null,{"$f":"IF(A28=\"\",\"\",HLOOKUP(A28,$C$11:$V$12,2))","v":""}]
[]
[null,{"$f":"IF(A30=\"\",\"\",HLOOKUP(A30,$C$11:$V$12,2))","v":""}]
[]
[null,{"$f":"IF(A32=\"\",\"\",HLOOKUP(A32,$C$11:$V$12,2))","v":""}]
[]
[null,{"$f":"IF(A34=\"\",\"\",HLOOKUP(A34,$C$11:$V$12,2))","v":""}]
[]
["↑",{"$f":"Daten!A113","v":"Anbieter (Nr. gemäss Offertöffnungprotokoll)"}]

{"sheet":"Kosten","index":5,"n_rows":35,"n_cols":42,"rows_kept":35,"cut":false,"hidden":false,"merged":[[30,0,30,1],[11,38,11,39],[11,40,11,41],[10,0,10,1],[11,26,11,27],[11,28,11,29],[11,30,11,31],[11,32,11,33],[11,34,11,35],[11,36,11,37],[11,14,11,15],[11,16,11,17],[11,18,11,19],[11,20,11,21],[11,22,11,23],[11,24,11,25],[11,2,11,3],[11,4,11,5],[11,6,11,7],[11,8,11,9],[11,10,11,11],[11,12,11,13],[10,40,10,41],[10,18,10,19],[10,20,10,21],[10,22,10,23],[10,24,10,25],[10,26,10,27],[10,28,10,29],[10,30,10,31],[10,32,10,33],[10,34,10,35],[10,36,10,37],[10,38,10,39],[9,38,9,39],[9,40,9,41],[10,2,10,3],[10,4,10,5],[10,6,10,7],[10,8,10,9],[10,10,10,11],[10,12,10,13],[10,14,10,15],[10,16,10,17],[9,26,9,27],[9,28,9,29],[9,30,9,31],[9,32,9,33],[9,34,9,35],[9,36,9,37],[9,2,9,3],[9,4,9,5],[9,6,9,7],[9,8,9,9],[9,10,9,11],[9,22,9,23],[9,24,9,25],[9,12,9,13],[9,14,9,15],[9,16,9,17],[9,18,9,19],[9,20,9,21]]}
[]
[{"$f":"Daten!A36","v":"Bereinigung der Kosten"}]
[]
[{"$f":"Daten!A37&\":\"","v":"Projektnummer:"},null,{"$f":"CELL(\"inhalt\",Info!D4:F4)","v":0}]
[]
[{"$f":"Daten!A38&\":\"","v":"Projektbezeichnung:"},null,{"$f":"CELL(\"inhalt\",Info!K4:M8)","v":0}]
[]
[{"$f":"Daten!A40&\":\"","v":"Vertragsgegenstand:"},null,{"$f":"CELL(\"inhalt\",Info!K11:M15)","v":0}]
[]
[{"$f":"Daten!A148","v":"Anbieter"},null,1,null,2,null,3,null,4,null,5,null,6,null,7,null,8,null,9,null,10,null,11,null,12,null,13,null,14,null,15,null,16,null,17,null,18,null,19,null,20]
[{"$f":"Daten!A149","v":"(Nr. gemäss Offertöffnungprotokoll)"},null,{"$f":"Auswertungstabelle!C3","v":""},null,{"$f":"Auswertungstabelle!D3","v":""},null,{"$f":"Auswertungstabelle!E3","v":""},null,{"$f":"Auswertungstabelle!F3","v":""},null,{"$f":"Auswertungstabelle!G3","v":""},null,{"$f":"Auswertungstabelle!H3","v":""},null,{"$f":"Auswertungstabelle!I3","v":""},null,{"$f":"Auswertungstabelle!J3","v":""},null,{"$f":"Auswertungstabelle!K3","v":""},null,{"$f":"Auswertungstabelle!L3","v":""},null,{"$f":"Auswertungstabelle!M3","v":""},null,{"$f":"Auswertungstabelle!N3","v":""},null,{"$f":"Auswertungstabelle!O3","v":""},null,{"$f":"Auswertungstabelle!P3","v":""},null,{"$f":"Auswertungstabelle!Q3","v":""},null,{"$f":"Auswertungstabelle!R3","v":""},null,{"$f":"Auswertungstabelle!S3","v":""},null,{"$f":"Auswertungstabelle!T3","v":""},null,{"$f":"Auswertungstabelle!U3","v":""},null,{"$f":"Auswertungstabelle!V3","v":""}]
[null,null,{"$f":"IF(Auswertungstabelle!C5=Daten!$A24,Daten!$A146,\"\")","v":""},null,{"$f":"IF(Auswertungstabelle!D5=Daten!$A24,Daten!$A146,\"\")","v":""},null,{"$f":"IF(Auswertungstabelle!E5=Daten!$A24,Daten!$A146,\"\")","v":""},null,{"$f":"IF(Auswertungstabelle!F5=Daten!$A24,Daten!$A146,\"\")","v":""},null,{"$f":"IF(Auswertungstabelle!G5=Daten!$A24,Daten!$A146,\"\")","v":""},null,{"$f":"IF(Auswertungstabelle!H5=Daten!$A24,Daten!$A146,\"\")","v":""},null,{"$f":"IF(Auswertungstabelle!I5=Daten!$A24,Daten!$A146,\"\")","v":""},null,{"$f":"IF(Auswertungstabelle!J5=Daten!$A24,Daten!$A146,\"\")","v":""},null,{"$f":"IF(Auswertungstabelle!K5=Daten!$A24,Daten!$A146,\"\")","v":""},null,{"$f":"IF(Auswertungstabelle!L5=Daten!$A24,Daten!$A146,\"\")","v":""},null,{"$f":"IF(Auswertungstabelle!M5=Daten!$A24,Daten!$A146,\"\")","v":""},null,{"$f":"IF(Auswertungstabelle!N5=Daten!$A24,Daten!$A146,\"\")","v":""},null,{"$f":"IF(Auswertungstabelle!O5=Daten!$A24,Daten!$A146,\"\")","v":""},null,{"$f":"IF(Auswertungstabelle!P5=Daten!$A24,Daten!$A146,\"\")","v":""},null,{"$f":"IF(Auswertungstabelle!Q5=Daten!$A24,Daten!$A146,\"\")","v":""},null,{"$f":"IF(Auswertungstabelle!R5=Daten!$A24,Daten!$A146,\"\")","v":""},null,{"$f":"IF(Auswertungstabelle!S5=Daten!$A24,Daten!$A146,\"\")","v":""},null,{"$f":"IF(Auswertungstabelle!T5=Daten!$A24,Daten!$A146,\"\")","v":""},null,{"$f":"IF(Auswertungstabelle!U5=Daten!$A24,Daten!$A146,\"\")","v":""},null,{"$f":"IF(Auswertungstabelle!V5=Daten!$A24,Daten!$A146,\"\")","v":""}]
[]
[{"$f":"Daten!A150","v":"Skonto in Vergabesumme berücksichtigen?"},"nein"]
[]
[{"$f":"Daten!A151","v":"Eingabesumme brutto exkl. MWST (Offertöffnung)"},null,null,{"$f":"IF(C11=\"\",\"\",Auswertungstabelle!C6)","v":""},null,{"$f":"IF(E11=\"\",\"\",Auswertungstabelle!D6)","v":""},null,{"$f":"IF(G11=\"\",\"\",Auswertungstabelle!E6)","v":""},null,{"$f":"IF(I11=\"\",\"\",Auswertungstabelle!F6)","v":""},null,{"$f":"IF(K11=\"\",\"\",Auswertungstabelle!G6)","v":""},null,{"$f":"IF(M11=\"\",\"\",Auswertungstabelle!H6)","v":""},null,{"$f":"IF(O11=\"\",\"\",Auswertungstabelle!I6)","v":""},null,{"$f":"IF(Q11=\"\",\"\",Auswertungstabelle!J6)","v":""},null,{"$f":"IF(S11=\"\",\"\",Auswertungstabelle!K6)","v":""},null,{"$f":"IF(U11=\"\",\"\",Auswertungstabelle!L6)","v":""},null,{"$f":"IF(W11=\"\",\"\",Auswertungstabelle!M6)","v":""},null,{"$f":"IF(Y11=\"\",\"\",Auswertungstabelle!N6)","v":""},null,{"$f":"IF(AA11=\"\",\"\",Auswertungstabelle!O6)","v":""},null,{"$f":"IF(AC11=\"\",\"\",Auswertungstabelle!P6)","v":""},null,{"$f":"IF(AE11=\"\",\"\",Auswertungstabelle!Q6)","v":""},null,{"$f":"IF(AG11=\"\",\"\",Auswertungstabelle!R6)","v":""},null,{"$f":"IF(AI11=\"\",\"\",Auswertungstabelle!S6)","v":""},null,{"$f":"IF(AK11=\"\",\"\",Auswertungstabelle!T6)","v":""},null,{"$f":"IF(AM11=\"\",\"\",Auswertungstabelle!U6)","v":""},null,{"$f":"IF(AO11=\"\",\"\",Auswertungstabelle!V6)","v":""}]
[{"$f":"Daten!A152","v":"Allgemeiner Abzug"},null,null,{"$f":"IF(D16=\"\",\"\",C17*D16)","v":""},null,{"$f":"IF(F16=\"\",\"\",E17*F16)","v":""},null,{"$f":"IF(H16=\"\",\"\",G17*H16)","v":""},null,{"$f":"IF(J16=\"\",\"\",I17*J16)","v":""},null,{"$f":"IF(L16=\"\",\"\",K17*L16)","v":""},null,{"$f":"IF(N16=\"\",\"\",M17*N16)","v":""},null,{"$f":"IF(P16=\"\",\"\",O17*P16)","v":""},null,{"$f":"IF(R16=\"\",\"\",Q17*R16)","v":""},null,{"$f":"IF(T16=\"\",\"\",S17*T16)","v":""},null,{"$f":"IF(V16=\"\",\"\",U17*V16)","v":""},null,{"$f":"IF(X16=\"\",\"\",W17*X16)","v":""},null,{"$f":"IF(Z16=\"\",\"\",Y17*Z16)","v":""},null,{"$f":"IF(AB16=\"\",\"\",AA17*AB16)","v":""},null,{"$f":"IF(AD16=\"\",\"\",AC17*AD16)","v":""},null,{"$f":"IF(AF16=\"\",\"\",AE17*AF16)","v":""},null,{"$f":"IF(AH16=\"\",\"\",AG17*AH16)","v":""},null,{"$f":"IF(AJ16=\"\",\"\",AI17*AJ16)","v":""},null,{"$f":"IF(AL16=\"\",\"\",AK17*AL16)","v":""},null,{"$f":"IF(AN16=\"\",\"\",AM17*AN16)","v":""},null,{"$f":"IF(AP16=\"\",\"\",AO17*AP16)","v":""}]
[{"$f":"Daten!A153","v":"Differenzbetrag nach technischer Bereinigung"}]
[null,null,null,{"$f":"IF(D16=\"\",\"\",SUM(D16:D18))","v":""},null,{"$f":"IF(F16=\"\",\"\",SUM(F16:F18))","v":""},null,{"$f":"IF(H16=\"\",\"\",SUM(H16:H18))","v":""},null,{"$f":"IF(J16=\"\",\"\",SUM(J16:J18))","v":""},null,{"$f":"IF(L16=\"\",\"\",SUM(L16:L18))","v":""},null,{"$f":"IF(N16=\"\",\"\",SUM(N16:N18))","v":""},null,{"$f":"IF(P16=\"\",\"\",SUM(P16:P18))","v":""},null,{"$f":"IF(R16=\"\",\"\",SUM(R16:R18))","v":""},null,{"$f":"IF(T16=\"\",\"\",SUM(T16:T18))","v":""},null,{"$f":"IF(V16=\"\",\"\",SUM(V16:V18))","v":""},null,{"$f":"IF(X16=\"\",\"\",SUM(X16:X18))","v":""},null,{"$f":"IF(Z16=\"\",\"\",SUM(Z16:Z18))","v":""},null,{"$f":"IF(AB16=\"\",\"\",SUM(AB16:AB18))","v":""},null,{"$f":"IF(AD16=\"\",\"\",SUM(AD16:AD18))","v":""},null,{"$f":"IF(AF16=\"\",\"\",SUM(AF16:AF18))","v":""},null,{"$f":"IF(AH16=\"\",\"\",SUM(AH16:AH18))","v":""},null,{"$f":"IF(AJ16=\"\",\"\",SUM(AJ16:AJ18))","v":""},null,{"$f":"IF(AL16=\"\",\"\",SUM(AL16:AL18))","v":""},null,{"$f":"IF(AN16=\"\",\"\",SUM(AN16:AN18))","v":""},null,{"$f":"IF(AP16=\"\",\"\",SUM(AP16:AP18))","v":""}]
[{"$f":"Daten!A154","v":"Rabatt gem. Angebot"},null,{"$f":"IF(D16=\"\",\"\",Auswertungstabelle!C9/100*-1)","v":""},{"$f":"IF(D16=\"\",\"\",C20*D19)","v":""},{"$f":"IF(F16=\"\",\"\",Auswertungstabelle!D9/100*-1)","v":""},{"$f":"IF(F16=\"\",\"\",E20*F19)","v":""},{"$f":"IF(H16=\"\",\"\",Auswertungstabelle!E9/100*-1)","v":""},{"$f":"IF(H16=\"\",\"\",G20*H19)","v":""},{"$f":"IF(J16=\"\",\"\",Auswertungstabelle!F9/100*-1)","v":""},{"$f":"IF(J16=\"\",\"\",I20*J19)","v":""},{"$f":"IF(L16=\"\",\"\",Auswertungstabelle!G9/100*-1)","v":""},{"$f":"IF(L16=\"\",\"\",K20*L19)","v":""},{"$f":"IF(N16=\"\",\"\",Auswertungstabelle!H9/100*-1)","v":""},{"$f":"IF(N16=\"\",\"\",M20*N19)","v":""},{"$f":"IF(P16=\"\",\"\",Auswertungstabelle!I9/100*-1)","v":""},{"$f":"IF(P16=\"\",\"\",O20*P19)","v":""},{"$f":"IF(R16=\"\",\"\",Auswertungstabelle!J9/100*-1)","v":""},{"$f":"IF(R16=\"\",\"\",Q20*R19)","v":""},{"$f":"IF(T16=\"\",\"\",Auswertungstabelle!K9/100*-1)","v":""},{"$f":"IF(T16=\"\",\"\",S20*T19)","v":""},{"$f":"IF(V16=\"\",\"\",Auswertungstabelle!L9/100*-1)","v":""},{"$f":"IF(V16=\"\",\"\",U20*V19)","v":""},{"$f":"IF(X16=\"\",\"\",Auswertungstabelle!M9/100*-1)","v":""},{"$f":"IF(X16=\"\",\"\",W20*X19)","v":""},{"$f":"IF(Z16=\"\",\"\",Auswertungstabelle!N9/100*-1)","v":""},{"$f":"IF(Z16=\"\",\"\",Y20*Z19)","v":""},{"$f":"IF(AB16=\"\",\"\",Auswertungstabelle!O9/100*-1)","v":""},{"$f":"IF(AB16=\"\",\"\",AA20*AB19)","v":""},{"$f":"IF(AD16=\"\",\"\",Auswertungstabelle!P9/100*-1)","v":""},{"$f":"IF(AD16=\"\",\"\",AC20*AD19)","v":""},{"$f":"IF(AF16=\"\",\"\",Auswertungstabelle!Q9/100*-1)","v":""},{"$f":"IF(AF16=\"\",\"\",AE20*AF19)","v":""},{"$f":"IF(AH16=\"\",\"\",Auswertungstabelle!R9/100*-1)","v":""},{"$f":"IF(AH16=\"\",\"\",AG20*AH19)","v":""},{"$f":"IF(AJ16=\"\",\"\",Auswertungstabelle!S9/100*-1)","v":""},{"$f":"IF(AJ16=\"\",\"\",AI20*AJ19)","v":""},{"$f":"IF(AL16=\"\",\"\",Auswertungstabelle!T9/100*-1)","v":""},{"$f":"IF(AL16=\"\",\"\",AK20*AL19)","v":""},{"$f":"IF(AN16=\"\",\"\",Auswertungstabelle!U9/100*-1)","v":""},{"$f":"IF(AN16=\"\",\"\",AM20*AN19)","v":""},{"$f":"IF(AP16=\"\",\"\",Auswertungstabelle!V9/100*-1)","v":""},{"$f":"IF(AP16=\"\",\"\",AO20*AP19)","v":""}]
[null,null,null,{"$f":"IF(D16=\"\",\"\",D19+D20)","v":""},null,{"$f":"IF(F16=\"\",\"\",F19+F20)","v":""},null,{"$f":"IF(H16=\"\",\"\",H19+H20)","v":""},null,{"$f":"IF(J16=\"\",\"\",J19+J20)","v":""},null,{"$f":"IF(L16=\"\",\"\",L19+L20)","v":""},null,{"$f":"IF(N16=\"\",\"\",N19+N20)","v":""},null,{"$f":"IF(P16=\"\",\"\",P19+P20)","v":""},null,{"$f":"IF(R16=\"\",\"\",R19+R20)","v":""},null,{"$f":"IF(T16=\"\",\"\",T19+T20)","v":""},null,{"$f":"IF(V16=\"\",\"\",V19+V20)","v":""},null,{"$f":"IF(X16=\"\",\"\",X19+X20)","v":""},null,{"$f":"IF(Z16=\"\",\"\",Z19+Z20)","v":""},null,{"$f":"IF(AB16=\"\",\"\",AB19+AB20)","v":""},null,{"$f":"IF(AD16=\"\",\"\",AD19+AD20)","v":""},null,{"$f":"IF(AF16=\"\",\"\",AF19+AF20)","v":""},null,{"$f":"IF(AH16=\"\",\"\",AH19+AH20)","v":""},null,{"$f":"IF(AJ16=\"\",\"\",AJ19+AJ20)","v":""},null,{"$f":"IF(AL16=\"\",\"\",AL19+AL20)","v":""},null,{"$f":"IF(AN16=\"\",\"\",AN19+AN20)","v":""},null,{"$f":"IF(AP16=\"\",\"\",AP19+AP20)","v":""}]
[{"$f":"Daten!A152","v":"Allgemeiner Abzug"},null,null,{"$f":"IF(D16=\"\",\"\",$B$22*D21)","v":""},null,{"$f":"IF(F16=\"\",\"\",$B$22*F21)","v":""},null,{"$f":"IF(H16=\"\",\"\",$B$22*H21)","v":""},null,{"$f":"IF(J16=\"\",\"\",$B$22*J21)","v":""},null,{"$f":"IF(L16=\"\",\"\",$B$22*L21)","v":""},null,{"$f":"IF(N16=\"\",\"\",$B$22*N21)","v":""},null,{"$f":"IF(P16=\"\",\"\",$B$22*P21)","v":""},null,{"$f":"IF(R16=\"\",\"\",$B$22*R21)","v":""},null,{"$f":"IF(T16=\"\",\"\",$B$22*T21)","v":""},null,{"$f":"IF(V16=\"\",\"\",$B$22*V21)","v":""},null,{"$f":"IF(X16=\"\",\"\",$B$22*X21)","v":""},null,{"$f":"IF(Z16=\"\",\"\",$B$22*Z21)","v":""},null,{"$f":"IF(AB16=\"\",\"\",$B$22*AB21)","v":""},null,{"$f":"IF(AD16=\"\",\"\",$B$22*AD21)","v":""},null,{"$f":"IF(AF16=\"\",\"\",$B$22*AF21)","v":""},null,{"$f":"IF(AH16=\"\",\"\",$B$22*AH21)","v":""},null,{"$f":"IF(AJ16=\"\",\"\",$B$22*AJ21)","v":""},null,{"$f":"IF(AL16=\"\",\"\",$B$22*AL21)","v":""},null,{"$f":"IF(AN16=\"\",\"\",$B$22*AN21)","v":""},null,{"$f":"IF(AP16=\"\",\"\",$B$22*AP21)","v":""}]
[null,null,null,{"$f":"IF(D16=\"\",\"\",D21+D22)","v":""},null,{"$f":"IF(F16=\"\",\"\",F21+F22)","v":""},null,{"$f":"IF(H16=\"\",\"\",H21+H22)","v":""},null,{"$f":"IF(J16=\"\",\"\",J21+J22)","v":""},null,{"$f":"IF(L16=\"\",\"\",L21+L22)","v":""},null,{"$f":"IF(N16=\"\",\"\",N21+N22)","v":""},null,{"$f":"IF(P16=\"\",\"\",P21+P22)","v":""},null,{"$f":"IF(R16=\"\",\"\",R21+R22)","v":""},null,{"$f":"IF(T16=\"\",\"\",T21+T22)","v":""},null,{"$f":"IF(V16=\"\",\"\",V21+V22)","v":""},null,{"$f":"IF(X16=\"\",\"\",X21+X22)","v":""},null,{"$f":"IF(Z16=\"\",\"\",Z21+Z22)","v":""},null,{"$f":"IF(AB16=\"\",\"\",AB21+AB22)","v":""},null,{"$f":"IF(AD16=\"\",\"\",AD21+AD22)","v":""},null,{"$f":"IF(AF16=\"\",\"\",AF21+AF22)","v":""},null,{"$f":"IF(AH16=\"\",\"\",AH21+AH22)","v":""},null,{"$f":"IF(AJ16=\"\",\"\",AJ21+AJ22)","v":""},null,{"$f":"IF(AL16=\"\",\"\",AL21+AL22)","v":""},null,{"$f":"IF(AN16=\"\",\"\",AN21+AN22)","v":""},null,{"$f":"IF(AP16=\"\",\"\",AP21+AP22)","v":""}]
["Nebenkosten in %",null,null,{"$f":"IF(D23=\"\",\"\",C24*D23)","v":""},null,{"$f":"IF(F23=\"\",\"\",E24*F23)","v":""},null,{"$f":"IF(H23=\"\",\"\",G24*H23)","v":""},null,{"$f":"IF(J23=\"\",\"\",I24*J23)","v":""},null,{"$f":"IF(L23=\"\",\"\",K24*L23)","v":""},null,{"$f":"IF(N23=\"\",\"\",M24*N23)","v":""},null,{"$f":"IF(P23=\"\",\"\",O24*P23)","v":""},null,{"$f":"IF(R23=\"\",\"\",Q24*R23)","v":""},null,{"$f":"IF(T23=\"\",\"\",S24*T23)","v":""},null,{"$f":"IF(V23=\"\",\"\",U24*V23)","v":""},null,{"$f":"IF(X23=\"\",\"\",W24*X23)","v":""},null,{"$f":"IF(Z23=\"\",\"\",Y24*Z23)","v":""},null,{"$f":"IF(AB23=\"\",\"\",AA24*AB23)","v":""},null,{"$f":"IF(AD23=\"\",\"\",AC24*AD23)","v":""},null,{"$f":"IF(AF23=\"\",\"\",AE24*AF23)","v":""},null,{"$f":"IF(AH23=\"\",\"\",AG24*AH23)","v":""},null,{"$f":"IF(AJ23=\"\",\"\",AI24*AJ23)","v":""},null,{"$f":"IF(AL23=\"\",\"\",AK24*AL23)","v":""},null,{"$f":"IF(AN23=\"\",\"\",AM24*AN23)","v":""},null,{"$f":"IF(AP23=\"\",\"\",AO24*AP23)","v":""}]
[null,null,null,{"$f":"IF(D16=\"\",\"\",D23+D24)","v":""},null,{"$f":"IF(F16=\"\",\"\",F23+F24)","v":""},null,{"$f":"IF(H16=\"\",\"\",H23+H24)","v":""},null,{"$f":"IF(J16=\"\",\"\",J23+J24)","v":""},null,{"$f":"IF(L16=\"\",\"\",L23+L24)","v":""},null,{"$f":"IF(N16=\"\",\"\",N23+N24)","v":""},null,{"$f":"IF(P16=\"\",\"\",P23+P24)","v":""},null,{"$f":"IF(R16=\"\",\"\",R23+R24)","v":""},null,{"$f":"IF(T16=\"\",\"\",T23+T24)","v":""},null,{"$f":"IF(V16=\"\",\"\",V23+V24)","v":""},null,{"$f":"IF(X16=\"\",\"\",X23+X24)","v":""},null,{"$f":"IF(Z16=\"\",\"\",Z23+Z24)","v":""},null,{"$f":"IF(AB16=\"\",\"\",AB23+AB24)","v":""},null,{"$f":"IF(AD16=\"\",\"\",AD23+AD24)","v":""},null,{"$f":"IF(AF16=\"\",\"\",AF23+AF24)","v":""},null,{"$f":"IF(AH16=\"\",\"\",AH23+AH24)","v":""},null,{"$f":"IF(AJ16=\"\",\"\",AJ23+AJ24)","v":""},null,{"$f":"IF(AL16=\"\",\"\",AL23+AL24)","v":""},null,{"$f":"IF(AN16=\"\",\"\",AN23+AN24)","v":""},null,{"$f":"IF(AP16=\"\",\"\",AP23+AP24)","v":""}]
["Nebenkosten"]
[null,null,null,{"$f":"IF(D16=\"\",\"\",D25+D26)","v":""},null,{"$f":"IF(F16=\"\",\"\",F25+F26)","v":""},null,{"$f":"IF(H16=\"\",\"\",H25+H26)","v":""},null,{"$f":"IF(J16=\"\",\"\",J25+J26)","v":""},null,{"$f":"IF(L16=\"\",\"\",L25+L26)","v":""},null,{"$f":"IF(N16=\"\",\"\",N25+N26)","v":""},null,{"$f":"IF(P16=\"\",\"\",P25+P26)","v":""},null,{"$f":"IF(R16=\"\",\"\",R25+R26)","v":""},null,{"$f":"IF(T16=\"\",\"\",T25+T26)","v":""},null,{"$f":"IF(V16=\"\",\"\",V25+V26)","v":""},null,{"$f":"IF(X16=\"\",\"\",X25+X26)","v":""},null,{"$f":"IF(Z16=\"\",\"\",Z25+Z26)","v":""},null,{"$f":"IF(AB16=\"\",\"\",AB25+AB26)","v":""},null,{"$f":"IF(AD16=\"\",\"\",AD25+AD26)","v":""},null,{"$f":"IF(AF16=\"\",\"\",AF25+AF26)","v":""},null,{"$f":"IF(AH16=\"\",\"\",AH25+AH26)","v":""},null,{"$f":"IF(AJ16=\"\",\"\",AJ25+AJ26)","v":""},null,{"$f":"IF(AL16=\"\",\"\",AL25+AL26)","v":""},null,{"$f":"IF(AN16=\"\",\"\",AN25+AN26)","v":""},null,{"$f":"IF(AP16=\"\",\"\",AP25+AP26)","v":""}]
[{"$f":"Daten!A156","v":"Skonto"},null,{"$f":"IF(D16=\"\",\"\",IF($B$14=Daten!$A$24,0,Auswertungstabelle!C10/100*-1))","v":""},{"$f":"IF(D16=\"\",\"\",D27*C28)","v":""},{"$f":"IF(F16=\"\",\"\",IF($B$14=Daten!$A$24,0,Auswertungstabelle!D10/100*-1))","v":""},{"$f":"IF(F16=\"\",\"\",F27*E28)","v":""},{"$f":"IF(H16=\"\",\"\",IF($B$14=Daten!$A$24,0,Auswertungstabelle!E10/100*-1))","v":""},{"$f":"IF(H16=\"\",\"\",H27*G28)","v":""},{"$f":"IF(J16=\"\",\"\",IF($B$14=Daten!$A$24,0,Auswertungstabelle!F10/100*-1))","v":""},{"$f":"IF(J16=\"\",\"\",J27*I28)","v":""},{"$f":"IF(L16=\"\",\"\",IF($B$14=Daten!$A$24,0,Auswertungstabelle!G10/100*-1))","v":""},{"$f":"IF(L16=\"\",\"\",L27*K28)","v":""},{"$f":"IF(N16=\"\",\"\",IF($B$14=Daten!$A$24,0,Auswertungstabelle!H10/100*-1))","v":""},{"$f":"IF(N16=\"\",\"\",N27*M28)","v":""},{"$f":"IF(P16=\"\",\"\",IF($B$14=Daten!$A$24,0,Auswertungstabelle!I10/100*-1))","v":""},{"$f":"IF(P16=\"\",\"\",P27*O28)","v":""},{"$f":"IF(R16=\"\",\"\",IF($B$14=Daten!$A$24,0,Auswertungstabelle!J10/100*-1))","v":""},{"$f":"IF(R16=\"\",\"\",R27*Q28)","v":""},{"$f":"IF(T16=\"\",\"\",IF($B$14=Daten!$A$24,0,Auswertungstabelle!K10/100*-1))","v":""},{"$f":"IF(T16=\"\",\"\",T27*S28)","v":""},{"$f":"IF(V16=\"\",\"\",IF($B$14=Daten!$A$24,0,Auswertungstabelle!L10/100*-1))","v":""},{"$f":"IF(V16=\"\",\"\",V27*U28)","v":""},{"$f":"IF(X16=\"\",\"\",IF($B$14=Daten!$A$24,0,Auswertungstabelle!M10/100*-1))","v":""},{"$f":"IF(X16=\"\",\"\",X27*W28)","v":""},{"$f":"IF(Z16=\"\",\"\",IF($B$14=Daten!$A$24,0,Auswertungstabelle!N10/100*-1))","v":""},{"$f":"IF(Z16=\"\",\"\",Z27*Y28)","v":""},{"$f":"IF(AB16=\"\",\"\",IF($B$14=Daten!$A$24,0,Auswertungstabelle!O10/100*-1))","v":""},{"$f":"IF(AB16=\"\",\"\",AB27*AA28)","v":""},{"$f":"IF(AD16=\"\",\"\",IF($B$14=Daten!$A$24,0,Auswertungstabelle!P10/100*-1))","v":""},{"$f":"IF(AD16=\"\",\"\",AD27*AC28)","v":""},{"$f":"IF(AF16=\"\",\"\",IF($B$14=Daten!$A$24,0,Auswertungstabelle!Q10/100*-1))","v":""},{"$f":"IF(AF16=\"\",\"\",AF27*AE28)","v":""},{"$f":"IF(AH16=\"\",\"\",IF($B$14=Daten!$A$24,0,Auswertungstabelle!R10/100*-1))","v":""},{"$f":"IF(AH16=\"\",\"\",AH27*AG28)","v":""},{"$f":"IF(AJ16=\"\",\"\",IF($B$14=Daten!$A$24,0,Auswertungstabelle!S10/100*-1))","v":""},{"$f":"IF(AJ16=\"\",\"\",AJ27*AI28)","v":""},{"$f":"IF(AL16=\"\",\"\",IF($B$14=Daten!$A$24,0,Auswertungstabelle!T10/100*-1))","v":""},{"$f":"IF(AL16=\"\",\"\",AL27*AK28)","v":""},{"$f":"IF(AN16=\"\",\"\",IF($B$14=Daten!$A$24,0,Auswertungstabelle!U10/100*-1))","v":""},{"$f":"IF(AN16=\"\",\"\",AN27*AM28)","v":""},{"$f":"IF(AP16=\"\",\"\",IF($B$14=Daten!$A$24,0,Auswertungstabelle!V10/100*-1))","v":""},{"$f":"IF(AP16=\"\",\"\",AP27*AO28)","v":""}]
[null,null,null,{"$f":"IF(D16=\"\",\"\",D27+D28)","v":""},null,{"$f":"IF(F16=\"\",\"\",F27+F28)","v":""},null,{"$f":"IF(H16=\"\",\"\",H27+H28)","v":""},null,{"$f":"IF(J16=\"\",\"\",J27+J28)","v":""},null,{"$f":"IF(L16=\"\",\"\",L27+L28)","v":""},null,{"$f":"IF(N16=\"\",\"\",N27+N28)","v":""},null,{"$f":"IF(P16=\"\",\"\",P27+P28)","v":""},null,{"$f":"IF(R16=\"\",\"\",R27+R28)","v":""},null,{"$f":"IF(T16=\"\",\"\",T27+T28)","v":""},null,{"$f":"IF(V16=\"\",\"\",V27+V28)","v":""},null,{"$f":"IF(X16=\"\",\"\",X27+X28)","v":""},null,{"$f":"IF(Z16=\"\",\"\",Z27+Z28)","v":""},null,{"$f":"IF(AB16=\"\",\"\",AB27+AB28)","v":""},null,{"$f":"IF(AD16=\"\",\"\",AD27+AD28)","v":""},null,{"$f":"IF(AF16=\"\",\"\",AF27+AF28)","v":""},null,{"$f":"IF(AH16=\"\",\"\",AH27+AH28)","v":""},null,{"$f":"IF(AJ16=\"\",\"\",AJ27+AJ28)","v":""},null,{"$f":"IF(AL16=\"\",\"\",AL27+AL28)","v":""},null,{"$f":"IF(AN16=\"\",\"\",AN27+AN28)","v":""},null,{"$f":"IF(AP16=\"\",\"\",AP27+AP28)","v":""}]
[{"$f":"Daten!A155","v":"MWST"},0.081,null,{"$f":"IF(D16=\"\",\"\",$B$30*D29)","v":""},null,{"$f":"IF(F16=\"\",\"\",$B$30*F29)","v":""},null,{"$f":"IF(H16=\"\",\"\",$B$30*H29)","v":""},null,{"$f":"IF(J16=\"\",\"\",$B$30*J29)","v":""},null,{"$f":"IF(L16=\"\",\"\",$B$30*L29)","v":""},null,{"$f":"IF(N16=\"\",\"\",$B$30*N29)","v":""},null,{"$f":"IF(P16=\"\",\"\",$B$30*P29)","v":""},null,{"$f":"IF(R16=\"\",\"\",$B$30*R29)","v":""},null,{"$f":"IF(T16=\"\",\"\",$B$30*T29)","v":""},null,{"$f":"IF(V16=\"\",\"\",$B$30*V29)","v":""},null,{"$f":"IF(X16=\"\",\"\",$B$30*X29)","v":""},null,{"$f":"IF(Z16=\"\",\"\",$B$30*Z29)","v":""},null,{"$f":"IF(AB16=\"\",\"\",$B$30*AB29)","v":""},null,{"$f":"IF(AD16=\"\",\"\",$B$30*AD29)","v":""},null,{"$f":"IF(AF16=\"\",\"\",$B$30*AF29)","v":""},null,{"$f":"IF(AH16=\"\",\"\",$B$30*AH29)","v":""},null,{"$f":"IF(AJ16=\"\",\"\",$B$30*AJ29)","v":""},null,{"$f":"IF(AL16=\"\",\"\",$B$30*AL29)","v":""},null,{"$f":"IF(AN16=\"\",\"\",$B$30*AN29)","v":""},null,{"$f":"IF(AP16=\"\",\"\",$B$30*AP29)","v":""}]
[{"$f":"IF(B14=Daten!A23,Daten!A157,Daten!A158)","v":"Total netto inkl. MWST\n(Vergabevergleich)"},null,null,{"$f":"IF(D16=\"\",\"\",D29+D30)","v":""},null,{"$f":"IF(F16=\"\",\"\",F29+F30)","v":""},null,{"$f":"IF(H16=\"\",\"\",H29+H30)","v":""},null,{"$f":"IF(J16=\"\",\"\",J29+J30)","v":""},null,{"$f":"IF(L16=\"\",\"\",L29+L30)","v":""},null,{"$f":"IF(N16=\"\",\"\",N29+N30)","v":""},null,{"$f":"IF(P16=\"\",\"\",P29+P30)","v":""},null,{"$f":"IF(R16=\"\",\"\",R29+R30)","v":""},null,{"$f":"IF(T16=\"\",\"\",T29+T30)","v":""},null,{"$f":"IF(V16=\"\",\"\",V29+V30)","v":""},null,{"$f":"IF(X16=\"\",\"\",X29+X30)","v":""},null,{"$f":"IF(Z16=\"\",\"\",Z29+Z30)","v":""},null,{"$f":"IF(AB16=\"\",\"\",AB29+AB30)","v":""},null,{"$f":"IF(AD16=\"\",\"\",AD29+AD30)","v":""},null,{"$f":"IF(AF16=\"\",\"\",AF29+AF30)","v":""},null,{"$f":"IF(AH16=\"\",\"\",AH29+AH30)","v":""},null,{"$f":"IF(AJ16=\"\",\"\",AJ29+AJ30)","v":""},null,{"$f":"IF(AL16=\"\",\"\",AL29+AL30)","v":""},null,{"$f":"IF(AN16=\"\",\"\",AN29+AN30)","v":""},null,{"$f":"IF(AP16=\"\",\"\",AP29+AP30)","v":""}]
[]
[]
[]
[null,null,{"$f":"Daten!A18","v":"Vorzeichen beachten: Wenn Betrag abgezogen werden soll ein \" - \" (Minus) als Vorzeichen verwenden. Eingabe z.B. -1000"}]

{"sheet":"Zuschlag","index":6,"n_rows":68,"n_cols":44,"rows_kept":68,"cut":false,"hidden":false,"merged":[[14,37,15,37],[14,43,15,43],[14,38,15,38],[14,39,15,39],[14,40,15,40],[14,41,15,41],[14,42,15,42],[14,28,15,28],[14,29,15,29],[14,30,15,30],[14,31,15,31],[14,32,15,32],[14,33,15,33],[14,34,15,34],[14,35,15,35],[14,36,15,36],[14,26,15,26],[14,27,15,27],[10,18,10,19],[10,20,10,21],[10,22,10,23],[10,24,10,25],[10,26,10,27],[12,22,12,23],[12,24,12,25],[12,26,12,27],[10,40,10,41],[10,42,10,43],[11,4,11,5],[11,6,11,7],[11,8,11,9],[11,10,11,11],[11,12,11,13],[11,14,11,15],[11,16,11,17],[10,28,10,29],[10,30,10,31],[10,32,10,33],[10,34,10,35],[10,36,10,37],[10,38,10,39],[10,16,10,17],[10,4,10,5],[10,6,10,7],[10,8,10,9],[10,10,10,11],[10,12,10,13],[10,14,10,15],[11,42,11,43],[11,30,11,31],[12,4,12,5],[12,6,12,7],[12,8,12,9],[12,10,12,11],[12,12,12,13],[12,14,12,15],[12,16,12,17],[12,18,12,19],[12,20,12,21],[11,32,11,33],[11,34,11,35],[11,36,11,37],[11,38,11,39],[11,40,11,41],[11,18,11,19],[11,20,11,21],[11,22,11,23],[11,24,11,25],[11,26,11,27],[11,28,11,29],[12,40,12,41],[12,42,12,43],[14,13,15,13],[14,4,15,4],[14,5,15,5],[14,6,15,6],[14,7,15,7],[14,8,15,8],[14,9,15,9],[14,10,15,10],[14,11,15,11],[14,12,15,12],[14,20,15,20],[14,21,15,21],[14,22,15,22],[14,23,15,23],[12,28,12,29],[12,30,12,31],[12,34,12,35],[12,36,12,37],[12,38,12,39],[12,32,12,33],[14,24,15,24],[14,25,15,25],[14,17,15,17],[14,18,15,18],[14,19,15,19],[62,4,62,5],[62,6,62,7],[62,8,62,9],[62,10,62,11],[62,12,62,13],[62,14,62,15],[62,16,62,17],[62,18,62,19],[14,14,15,14],[14,15,15,15],[14,16,15,16],[62,40,62,41],[62,42,62,43],[62,30,62,31],[62,32,62,33],[62,34,62,35],[62,36,62,37],[62,38,62,39],[62,20,62,21],[62,22,62,23],[62,24,62,25],[62,26,62,27],[62,28,62,29]]}
[]
[{"$f":"Daten!A34","v":"Prüfung der Zuschlagskriterien"}]
[]
[{"$f":"Daten!A37&\":\"","v":"Projektnummer:"},null,null,null,{"$f":"CELL(\"inhalt\",Info!D4:F4)","v":0}]
[]
[{"$f":"Daten!A38&\":\"","v":"Projektbezeichnung:"},null,null,null,{"$f":"CELL(\"inhalt\",Info!K4:M8)","v":0}]
[]
[{"$f":"Daten!A40&\":\"","v":"Vertragsgegenstand:"},null,null,null,{"$f":"CELL(\"inhalt\",Info!K11:M15)","v":0}]
[]
[]
[{"$f":"Daten!A148","v":"Anbieter"},null,null,null,1,null,2,null,3,null,4,null,5,null,6,null,7,null,8,null,9,null,10,null,11,null,12,null,13,null,14,null,15,null,16,null,17,null,18,null,19,null,20]
[{"$f":"Daten!A149","v":"(Nr. gemäss Offertöffnungprotokoll)"},null,null,null,{"$f":"Auswertungstabelle!C3","v":""},null,{"$f":"Auswertungstabelle!D3","v":""},null,{"$f":"Auswertungstabelle!E3","v":""},null,{"$f":"Auswertungstabelle!F3","v":""},null,{"$f":"Auswertungstabelle!G3","v":""},null,{"$f":"Auswertungstabelle!H3","v":""},null,{"$f":"Auswertungstabelle!I3","v":""},null,{"$f":"Auswertungstabelle!J3","v":""},null,{"$f":"Auswertungstabelle!K3","v":""},null,{"$f":"Auswertungstabelle!L3","v":""},null,{"$f":"Auswertungstabelle!M3","v":""},null,{"$f":"Auswertungstabelle!N3","v":""},null,{"$f":"Auswertungstabelle!O3","v":""},null,{"$f":"Auswertungstabelle!P3","v":""},null,{"$f":"Auswertungstabelle!Q3","v":""},null,{"$f":"Auswertungstabelle!R3","v":""},null,{"$f":"Auswertungstabelle!S3","v":""},null,{"$f":"Auswertungstabelle!T3","v":""},null,{"$f":"Auswertungstabelle!U3","v":""},null,{"$f":"Auswertungstabelle!V3","v":""}]
[{"$nulls":4},{"$f":"IF(Auswertungstabelle!C5=Daten!$A24,Daten!$A146,\"\")","v":""},null,{"$f":"IF(Auswertungstabelle!D5=Daten!$A24,Daten!$A146,\"\")","v":""},null,{"$f":"IF(Auswertungstabelle!E5=Daten!$A24,Daten!$A146,\"\")","v":""},null,{"$f":"IF(Auswertungstabelle!F5=Daten!$A24,Daten!$A146,\"\")","v":""},null,{"$f":"IF(Auswertungstabelle!G5=Daten!$A24,Daten!$A146,\"\")","v":""},null,{"$f":"IF(Auswertungstabelle!H5=Daten!$A24,Daten!$A146,\"\")","v":""},null,{"$f":"IF(Auswertungstabelle!I5=Daten!$A24,Daten!$A146,\"\")","v":""},null,{"$f":"IF(Auswertungstabelle!J5=Daten!$A24,Daten!$A146,\"\")","v":""},null,{"$f":"IF(Auswertungstabelle!K5=Daten!$A24,Daten!$A146,\"\")","v":""},null,{"$f":"IF(Auswertungstabelle!L5=Daten!$A24,Daten!$A146,\"\")","v":""},null,{"$f":"IF(Auswertungstabelle!M5=Daten!$A24,Daten!$A146,\"\")","v":""},null,{"$f":"IF(Auswertungstabelle!N5=Daten!$A24,Daten!$A146,\"\")","v":""},null,{"$f":"IF(Auswertungstabelle!O5=Daten!$A24,Daten!$A146,\"\")","v":""},null,{"$f":"IF(Auswertungstabelle!P5=Daten!$A24,Daten!$A146,\"\")","v":""},null,{"$f":"IF(Auswertungstabelle!Q5=Daten!$A24,Daten!$A146,\"\")","v":""},null,{"$f":"IF(Auswertungstabelle!R5=Daten!$A24,Daten!$A146,\"\")","v":""},null,{"$f":"IF(Auswertungstabelle!S5=Daten!$A24,Daten!$A146,\"\")","v":""},null,{"$f":"IF(Auswertungstabelle!T5=Daten!$A24,Daten!$A146,\"\")","v":""},null,{"$f":"IF(Auswertungstabelle!U5=Daten!$A24,Daten!$A146,\"\")","v":""},null,{"$f":"IF(Auswertungstabelle!V5=Daten!$A24,Daten!$A146,\"\")","v":""}]
[]
[{"$f":"Daten!A127","v":"Nr."},{"$f":"Daten!A128","v":"Zuschlagskriterien"},{"$f":"Daten!A130","v":"Nachweis"},{"$f":"Daten!A131","v":"Ge-\nwicht (%)"},{"$f":"Daten!$A$133","v":"Pkt."},{"$f":"Daten!$A$134","v":"G * Pkt."},{"$f":"Daten!$A$133","v":"Pkt."},{"$f":"Daten!$A$134","v":"G * Pkt."},{"$f":"Daten!$A$133","v":"Pkt."},{"$f":"Daten!$A$134","v":"G * Pkt."},{"$f":"Daten!$A$133","v":"Pkt."},{"$f":"Daten!$A$134","v":"G * Pkt."},{"$f":"Daten!$A$133","v":"Pkt."},{"$f":"Daten!$A$134","v":"G * Pkt."},{"$f":"Daten!$A$133","v":"Pkt."},{"$f":"Daten!$A$134","v":"G * Pkt."},{"$f":"Daten!$A$133","v":"Pkt."},{"$f":"Daten!$A$134","v":"G * Pkt."},{"$f":"Daten!$A$133","v":"Pkt."},{"$f":"Daten!$A$134","v":"G * Pkt."},{"$f":"Daten!$A$133","v":"Pkt."},{"$f":"Daten!$A$134","v":"G * Pkt."},{"$f":"Daten!$A$133","v":"Pkt."},{"$f":"Daten!$A$134","v":"G * Pkt."},{"$f":"Daten!$A$133","v":"Pkt."},{"$f":"Daten!$A$134","v":"G * Pkt."},{"$f":"Daten!$A$133","v":"Pkt."},{"$f":"Daten!$A$134","v":"G * Pkt."},{"$f":"Daten!$A$133","v":"Pkt."},{"$f":"Daten!$A$134","v":"G * Pkt."},{"$f":"Daten!$A$133","v":"Pkt."},{"$f":"Daten!$A$134","v":"G * Pkt."},{"$f":"Daten!$A$133","v":"Pkt."},{"$f":"Daten!$A$134","v":"G * Pkt."},{"$f":"Daten!$A$133","v":"Pkt."},{"$f":"Daten!$A$134","v":"G * Pkt."},{"$f":"Daten!$A$133","v":"Pkt."},{"$f":"Daten!$A$134","v":"G * Pkt."},{"$f":"Daten!$A$133","v":"Pkt."},{"$f":"Daten!$A$134","v":"G * Pkt."},{"$f":"Daten!$A$133","v":"Pkt."},{"$f":"Daten!$A$134","v":"G * Pkt."},{"$f":"Daten!$A$133","v":"Pkt."},{"$f":"Daten!$A$134","v":"G * Pkt."}]
[null,{"$f":"Daten!A129","v":"(gemäss Ausschreibung)"},{"$f":"Daten!A129","v":"(gemäss Ausschreibung)"},{"$f":"Daten!A132","v":"G"}]
[]
[1,{"$f":"Daten!A172","v":"Preis"},null,0.60,{"$f":"IF($C$19=Daten!$A$169,Auswertungstabelle!C21,Auswertungstabelle!C23)","v":""},{"$f":"IF(OR(E18=\"\",$D18=\"\"),\"\",$D$18*E18*100)","v":""},{"$f":"IF($C$19=Daten!$A$169,Auswertungstabelle!D21,Auswertungstabelle!D23)","v":""},{"$f":"IF(OR(G18=\"\",$D18=\"\"),\"\",$D$18*G18*100)","v":""},{"$f":"IF($C$19=Daten!$A$169,Auswertungstabelle!E21,Auswertungstabelle!E23)","v":""},{"$f":"IF(OR(I18=\"\",$D18=\"\"),\"\",$D$18*I18*100)","v":""},{"$f":"IF($C$19=Daten!$A$169,Auswertungstabelle!F21,Auswertungstabelle!F23)","v":""},{"$f":"IF(OR(K18=\"\",$D18=\"\"),\"\",$D$18*K18*100)","v":""},{"$f":"IF($C$19=Daten!$A$169,Auswertungstabelle!G21,Auswertungstabelle!G23)","v":""},{"$f":"IF(OR(M18=\"\",$D18=\"\"),\"\",$D$18*M18*100)","v":""},{"$f":"IF($C$19=Daten!$A$169,Auswertungstabelle!H21,Auswertungstabelle!H23)","v":""},{"$f":"IF(OR(O18=\"\",$D18=\"\"),\"\",$D$18*O18*100)","v":""},{"$f":"IF($C$19=Daten!$A$169,Auswertungstabelle!I21,Auswertungstabelle!I23)","v":""},{"$f":"IF(OR(Q18=\"\",$D18=\"\"),\"\",$D$18*Q18*100)","v":""},{"$f":"IF($C$19=Daten!$A$169,Auswertungstabelle!J21,Auswertungstabelle!J23)","v":""},{"$f":"IF(OR(S18=\"\",$D18=\"\"),\"\",$D$18*S18*100)","v":""},{"$f":"IF($C$19=Daten!$A$169,Auswertungstabelle!K21,Auswertungstabelle!K23)","v":""},{"$f":"IF(OR(U18=\"\",$D18=\"\"),\"\",$D$18*U18*100)","v":""},{"$f":"IF($C$19=Daten!$A$169,Auswertungstabelle!L21,Auswertungstabelle!L23)","v":""},{"$f":"IF(OR(W18=\"\",$D18=\"\"),\"\",$D$18*W18*100)","v":""},{"$f":"IF($C$19=Daten!$A$169,Auswertungstabelle!M21,Auswertungstabelle!M23)","v":""},{"$f":"IF(OR(Y18=\"\",$D18=\"\"),\"\",$D$18*Y18*100)","v":""},{"$f":"IF($C$19=Daten!$A$169,Auswertungstabelle!N21,Auswertungstabelle!N23)","v":""},{"$f":"IF(OR(AA18=\"\",$D18=\"\"),\"\",$D$18*AA18*100)","v":""},{"$f":"IF($C$19=Daten!$A$169,Auswertungstabelle!O21,Auswertungstabelle!O23)","v":""},{"$f":"IF(OR(AC18=\"\",$D18=\"\"),\"\",$D$18*AC18*100)","v":""},{"$f":"IF($C$19=Daten!$A$169,Auswertungstabelle!P21,Auswertungstabelle!P23)","v":""},{"$f":"IF(OR(AE18=\"\",$D18=\"\"),\"\",$D$18*AE18*100)","v":""},{"$f":"IF($C$19=Daten!$A$169,Auswertungstabelle!Q21,Auswertungstabelle!Q23)","v":""},{"$f":"IF(OR(AG18=\"\",$D18=\"\"),\"\",$D$18*AG18*100)","v":""},{"$f":"IF($C$19=Daten!$A$169,Auswertungstabelle!R21,Auswertungstabelle!R23)","v":""},{"$f":"IF(OR(AI18=\"\",$D18=\"\"),\"\",$D$18*AI18*100)","v":""},{"$f":"IF($C$19=Daten!$A$169,Auswertungstabelle!S21,Auswertungstabelle!S23)","v":""},{"$f":"IF(OR(AK18=\"\",$D18=\"\"),\"\",$D$18*AK18*100)","v":""},{"$f":"IF($C$19=Daten!$A$169,Auswertungstabelle!T21,Auswertungstabelle!T23)","v":""},{"$f":"IF(OR(AM18=\"\",$D18=\"\"),\"\",$D$18*AM18*100)","v":""},{"$f":"IF($C$19=Daten!$A$169,Auswertungstabelle!U21,Auswertungstabelle!U23)","v":""},{"$f":"IF(OR(AO18=\"\",$D18=\"\"),\"\",$D$18*AO18*100)","v":""},{"$f":"IF($C$19=Daten!$A$169,Auswertungstabelle!V21,Auswertungstabelle!V23)","v":""},{"$f":"IF(OR(AQ18=\"\",$D18=\"\"),\"\",$D$18*AQ18*100)","v":""}]
[null,{"$f":"Daten!A168","v":"Berechnungsart:"},"linear"]
[null,{"$f":"Daten!A167","v":"Preisspanne: 100% -"},150,"%"]
[null,null,{"$f":"IF(C19=Daten!A170,Daten!A171,\"\")","v":""}]
[]
["2","Z2 Schlüsselpersonen","Teil B, Doc 13, Formular 4",null,null,{"$f":"IF(OR(E23=\"\",$D23=\"\"),\"\",$D23*E23*100)","v":""},null,{"$f":"IF(OR(G23=\"\",$D23=\"\"),\"\",$D23*G23*100)","v":""},null,{"$f":"IF(OR(I23=\"\",$D23=\"\"),\"\",$D23*I23*100)","v":""},null,{"$f":"IF(OR(K23=\"\",$D23=\"\"),\"\",$D23*K23*100)","v":""},null,{"$f":"IF(OR(M23=\"\",$D23=\"\"),\"\",$D23*M23*100)","v":""},null,{"$f":"IF(OR(O23=\"\",$D23=\"\"),\"\",$D23*O23*100)","v":""},null,{"$f":"IF(OR(Q23=\"\",$D23=\"\"),\"\",$D23*Q23*100)","v":""},null,{"$f":"IF(OR(S23=\"\",$D23=\"\"),\"\",$D23*S23*100)","v":""},null,{"$f":"IF(OR(U23=\"\",$D23=\"\"),\"\",$D23*U23*100)","v":""},null,{"$f":"IF(OR(W23=\"\",$D23=\"\"),\"\",$D23*W23*100)","v":""},null,{"$f":"IF(OR(Y23=\"\",$D23=\"\"),\"\",$D23*Y23*100)","v":""},null,{"$f":"IF(OR(AA23=\"\",$D23=\"\"),\"\",$D23*AA23*100)","v":""},null,{"$f":"IF(OR(AC23=\"\",$D23=\"\"),\"\",$D23*AC23*100)","v":""},null,{"$f":"IF(OR(AE23=\"\",$D23=\"\"),\"\",$D23*AE23*100)","v":""},null,{"$f":"IF(OR(AG23=\"\",$D23=\"\"),\"\",$D23*AG23*100)","v":""},null,{"$f":"IF(OR(AI23=\"\",$D23=\"\"),\"\",$D23*AI23*100)","v":""},null,{"$f":"IF(OR(AK23=\"\",$D23=\"\"),\"\",$D23*AK23*100)","v":""},null,{"$f":"IF(OR(AM23=\"\",$D23=\"\"),\"\",$D23*AM23*100)","v":""},null,{"$f":"IF(OR(AO23=\"\",$D23=\"\"),\"\",$D23*AO23*100)","v":""},null,{"$f":"IF(OR(AQ23=\"\",$D23=\"\"),\"\",$D23*AQ23*100)","v":""}]
[null,null,{"$f":"Daten!$A$143","v":"Zusammenzug aus Subkriterien:"},{"$f":"SUM(D25:D28)","v":0.25},null,{"$f":"IF(OR($D24=0,E$12=\"\"),\"\",SUM(F25:F28))","v":""},null,{"$f":"IF(OR($D24=0,G$12=\"\"),\"\",SUM(H25:H28))","v":""},null,{"$f":"IF(OR($D24=0,I$12=\"\"),\"\",SUM(J25:J28))","v":""},null,{"$f":"IF(OR($D24=0,K$12=\"\"),\"\",SUM(L25:L28))","v":""},null,{"$f":"IF(OR($D24=0,M$12=\"\"),\"\",SUM(N25:N28))","v":""},null,{"$f":"IF(OR($D24=0,O$12=\"\"),\"\",SUM(P25:P28))","v":""},null,{"$f":"IF(OR($D24=0,Q$12=\"\"),\"\",SUM(R25:R28))","v":""},null,{"$f":"IF(OR($D24=0,S$12=\"\"),\"\",SUM(T25:T28))","v":""},null,{"$f":"IF(OR($D24=0,U$12=\"\"),\"\",SUM(V25:V28))","v":""},null,{"$f":"IF(OR($D24=0,W$12=\"\"),\"\",SUM(X25:X28))","v":""},null,{"$f":"IF(OR($D24=0,Y$12=\"\"),\"\",SUM(Z25:Z28))","v":""},null,{"$f":"IF(OR($D24=0,AA$12=\"\"),\"\",SUM(AB25:AB28))","v":""},null,{"$f":"IF(OR($D24=0,AC$12=\"\"),\"\",SUM(AD25:AD28))","v":""},null,{"$f":"IF(OR($D24=0,AE$12=\"\"),\"\",SUM(AF25:AF28))","v":""},null,{"$f":"IF(OR($D24=0,AG$12=\"\"),\"\",SUM(AH25:AH28))","v":""},null,{"$f":"IF(OR($D24=0,AI$12=\"\"),\"\",SUM(AJ25:AJ28))","v":""},null,{"$f":"IF(OR($D24=0,AK$12=\"\"),\"\",SUM(AL25:AL28))","v":""},null,{"$f":"IF(OR($D24=0,AM$12=\"\"),\"\",SUM(AN25:AN28))","v":""},null,{"$f":"IF(OR($D24=0,AO$12=\"\"),\"\",SUM(AP25:AP28))","v":""},null,{"$f":"IF(OR($D24=0,AQ$12=\"\"),\"\",SUM(AR25:AR28))","v":""}]
["2.1","Referenzangaben 1",null,0.125,null,{"$f":"IF(OR(E25=\"\",$D25=\"\"),\"\",$D25*E25*100)","v":""},null,{"$f":"IF(OR(G25=\"\",$D25=\"\"),\"\",$D25*G25*100)","v":""},null,{"$f":"IF(OR(I25=\"\",$D25=\"\"),\"\",$D25*I25*100)","v":""},null,{"$f":"IF(OR(K25=\"\",$D25=\"\"),\"\",$D25*K25*100)","v":""},null,{"$f":"IF(OR(M25=\"\",$D25=\"\"),\"\",$D25*M25*100)","v":""},null,{"$f":"IF(OR(O25=\"\",$D25=\"\"),\"\",$D25*O25*100)","v":""},null,{"$f":"IF(OR(Q25=\"\",$D25=\"\"),\"\",$D25*Q25*100)","v":""},null,{"$f":"IF(OR(S25=\"\",$D25=\"\"),\"\",$D25*S25*100)","v":""},null,{"$f":"IF(OR(U25=\"\",$D25=\"\"),\"\",$D25*U25*100)","v":""},null,{"$f":"IF(OR(W25=\"\",$D25=\"\"),\"\",$D25*W25*100)","v":""},null,{"$f":"IF(OR(Y25=\"\",$D25=\"\"),\"\",$D25*Y25*100)","v":""},null,{"$f":"IF(OR(AA25=\"\",$D25=\"\"),\"\",$D25*AA25*100)","v":""},null,{"$f":"IF(OR(AC25=\"\",$D25=\"\"),\"\",$D25*AC25*100)","v":""},null,{"$f":"IF(OR(AE25=\"\",$D25=\"\"),\"\",$D25*AE25*100)","v":""},null,{"$f":"IF(OR(AG25=\"\",$D25=\"\"),\"\",$D25*AG25*100)","v":""},null,{"$f":"IF(OR(AI25=\"\",$D25=\"\"),\"\",$D25*AI25*100)","v":""},null,{"$f":"IF(OR(AK25=\"\",$D25=\"\"),\"\",$D25*AK25*100)","v":""},null,{"$f":"IF(OR(AM25=\"\",$D25=\"\"),\"\",$D25*AM25*100)","v":""},null,{"$f":"IF(OR(AO25=\"\",$D25=\"\"),\"\",$D25*AO25*100)","v":""},null,{"$f":"IF(OR(AQ25=\"\",$D25=\"\"),\"\",$D25*AQ25*100)","v":""}]
["2.2","Referenzangaben 2",null,0.125,null,{"$f":"IF(OR(E26=\"\",$D26=\"\"),\"\",$D26*E26*100)","v":""},null,{"$f":"IF(OR(G26=\"\",$D26=\"\"),\"\",$D26*G26*100)","v":""},null,{"$f":"IF(OR(I26=\"\",$D26=\"\"),\"\",$D26*I26*100)","v":""},null,{"$f":"IF(OR(K26=\"\",$D26=\"\"),\"\",$D26*K26*100)","v":""},null,{"$f":"IF(OR(M26=\"\",$D26=\"\"),\"\",$D26*M26*100)","v":""},null,{"$f":"IF(OR(O26=\"\",$D26=\"\"),\"\",$D26*O26*100)","v":""},null,{"$f":"IF(OR(Q26=\"\",$D26=\"\"),\"\",$D26*Q26*100)","v":""},null,{"$f":"IF(OR(S26=\"\",$D26=\"\"),\"\",$D26*S26*100)","v":""},null,{"$f":"IF(OR(U26=\"\",$D26=\"\"),\"\",$D26*U26*100)","v":""},null,{"$f":"IF(OR(W26=\"\",$D26=\"\"),\"\",$D26*W26*100)","v":""},null,{"$f":"IF(OR(Y26=\"\",$D26=\"\"),\"\",$D26*Y26*100)","v":""},null,{"$f":"IF(OR(AA26=\"\",$D26=\"\"),\"\",$D26*AA26*100)","v":""},null,{"$f":"IF(OR(AC26=\"\",$D26=\"\"),\"\",$D26*AC26*100)","v":""},null,{"$f":"IF(OR(AE26=\"\",$D26=\"\"),\"\",$D26*AE26*100)","v":""},null,{"$f":"IF(OR(AG26=\"\",$D26=\"\"),\"\",$D26*AG26*100)","v":""},null,{"$f":"IF(OR(AI26=\"\",$D26=\"\"),\"\",$D26*AI26*100)","v":""},null,{"$f":"IF(OR(AK26=\"\",$D26=\"\"),\"\",$D26*AK26*100)","v":""},null,{"$f":"IF(OR(AM26=\"\",$D26=\"\"),\"\",$D26*AM26*100)","v":""},null,{"$f":"IF(OR(AO26=\"\",$D26=\"\"),\"\",$D26*AO26*100)","v":""},null,{"$f":"IF(OR(AQ26=\"\",$D26=\"\"),\"\",$D26*AQ26*100)","v":""}]
["2.3",{"$nulls":4},{"$f":"IF(OR(E27=\"\",$D27=\"\"),\"\",$D27*E27*100)","v":""},null,{"$f":"IF(OR(G27=\"\",$D27=\"\"),\"\",$D27*G27*100)","v":""},null,{"$f":"IF(OR(I27=\"\",$D27=\"\"),\"\",$D27*I27*100)","v":""},null,{"$f":"IF(OR(K27=\"\",$D27=\"\"),\"\",$D27*K27*100)","v":""},null,{"$f":"IF(OR(M27=\"\",$D27=\"\"),\"\",$D27*M27*100)","v":""},null,{"$f":"IF(OR(O27=\"\",$D27=\"\"),\"\",$D27*O27*100)","v":""},null,{"$f":"IF(OR(Q27=\"\",$D27=\"\"),\"\",$D27*Q27*100)","v":""},null,{"$f":"IF(OR(S27=\"\",$D27=\"\"),\"\",$D27*S27*100)","v":""},null,{"$f":"IF(OR(U27=\"\",$D27=\"\"),\"\",$D27*U27*100)","v":""},null,{"$f":"IF(OR(W27=\"\",$D27=\"\"),\"\",$D27*W27*100)","v":""},null,{"$f":"IF(OR(Y27=\"\",$D27=\"\"),\"\",$D27*Y27*100)","v":""},null,{"$f":"IF(OR(AA27=\"\",$D27=\"\"),\"\",$D27*AA27*100)","v":""},null,{"$f":"IF(OR(AC27=\"\",$D27=\"\"),\"\",$D27*AC27*100)","v":""},null,{"$f":"IF(OR(AE27=\"\",$D27=\"\"),\"\",$D27*AE27*100)","v":""},null,{"$f":"IF(OR(AG27=\"\",$D27=\"\"),\"\",$D27*AG27*100)","v":""},null,{"$f":"IF(OR(AI27=\"\",$D27=\"\"),\"\",$D27*AI27*100)","v":""},null,{"$f":"IF(OR(AK27=\"\",$D27=\"\"),\"\",$D27*AK27*100)","v":""},null,{"$f":"IF(OR(AM27=\"\",$D27=\"\"),\"\",$D27*AM27*100)","v":""},null,{"$f":"IF(OR(AO27=\"\",$D27=\"\"),\"\",$D27*AO27*100)","v":""},null,{"$f":"IF(OR(AQ27=\"\",$D27=\"\"),\"\",$D27*AQ27*100)","v":""}]
["2.4",{"$nulls":4},{"$f":"IF(OR(E28=\"\",$D28=\"\"),\"\",$D28*E28*100)","v":""},null,{"$f":"IF(OR(G28=\"\",$D28=\"\"),\"\",$D28*G28*100)","v":""},null,{"$f":"IF(OR(I28=\"\",$D28=\"\"),\"\",$D28*I28*100)","v":""},null,{"$f":"IF(OR(K28=\"\",$D28=\"\"),\"\",$D28*K28*100)","v":""},null,{"$f":"IF(OR(M28=\"\",$D28=\"\"),\"\",$D28*M28*100)","v":""},null,{"$f":"IF(OR(O28=\"\",$D28=\"\"),\"\",$D28*O28*100)","v":""},null,{"$f":"IF(OR(Q28=\"\",$D28=\"\"),\"\",$D28*Q28*100)","v":""},null,{"$f":"IF(OR(S28=\"\",$D28=\"\"),\"\",$D28*S28*100)","v":""},null,{"$f":"IF(OR(U28=\"\",$D28=\"\"),\"\",$D28*U28*100)","v":""},null,{"$f":"IF(OR(W28=\"\",$D28=\"\"),\"\",$D28*W28*100)","v":""},null,{"$f":"IF(OR(Y28=\"\",$D28=\"\"),\"\",$D28*Y28*100)","v":""},null,{"$f":"IF(OR(AA28=\"\",$D28=\"\"),\"\",$D28*AA28*100)","v":""},null,{"$f":"IF(OR(AC28=\"\",$D28=\"\"),\"\",$D28*AC28*100)","v":""},null,{"$f":"IF(OR(AE28=\"\",$D28=\"\"),\"\",$D28*AE28*100)","v":""},null,{"$f":"IF(OR(AG28=\"\",$D28=\"\"),\"\",$D28*AG28*100)","v":""},null,{"$f":"IF(OR(AI28=\"\",$D28=\"\"),\"\",$D28*AI28*100)","v":""},null,{"$f":"IF(OR(AK28=\"\",$D28=\"\"),\"\",$D28*AK28*100)","v":""},null,{"$f":"IF(OR(AM28=\"\",$D28=\"\"),\"\",$D28*AM28*100)","v":""},null,{"$f":"IF(OR(AO28=\"\",$D28=\"\"),\"\",$D28*AO28*100)","v":""},null,{"$f":"IF(OR(AQ28=\"\",$D28=\"\"),\"\",$D28*AQ28*100)","v":""}]
[]
["3","Z3 Technischer Bericht ","Teil B, Doc 13, Formular 6",null,null,{"$f":"IF(OR(E30=\"\",$D30=\"\"),\"\",$D30*E30*100)","v":""},null,{"$f":"IF(OR(G30=\"\",$D30=\"\"),\"\",$D30*G30*100)","v":""},null,{"$f":"IF(OR(I30=\"\",$D30=\"\"),\"\",$D30*I30*100)","v":""},null,{"$f":"IF(OR(K30=\"\",$D30=\"\"),\"\",$D30*K30*100)","v":""},null,{"$f":"IF(OR(M30=\"\",$D30=\"\"),\"\",$D30*M30*100)","v":""},null,{"$f":"IF(OR(O30=\"\",$D30=\"\"),\"\",$D30*O30*100)","v":""},null,{"$f":"IF(OR(Q30=\"\",$D30=\"\"),\"\",$D30*Q30*100)","v":""},null,{"$f":"IF(OR(S30=\"\",$D30=\"\"),\"\",$D30*S30*100)","v":""},null,{"$f":"IF(OR(U30=\"\",$D30=\"\"),\"\",$D30*U30*100)","v":""},null,{"$f":"IF(OR(W30=\"\",$D30=\"\"),\"\",$D30*W30*100)","v":""},null,{"$f":"IF(OR(Y30=\"\",$D30=\"\"),\"\",$D30*Y30*100)","v":""},null,{"$f":"IF(OR(AA30=\"\",$D30=\"\"),\"\",$D30*AA30*100)","v":""},null,{"$f":"IF(OR(AC30=\"\",$D30=\"\"),\"\",$D30*AC30*100)","v":""},null,{"$f":"IF(OR(AE30=\"\",$D30=\"\"),\"\",$D30*AE30*100)","v":""},null,{"$f":"IF(OR(AG30=\"\",$D30=\"\"),\"\",$D30*AG30*100)","v":""},null,{"$f":"IF(OR(AI30=\"\",$D30=\"\"),\"\",$D30*AI30*100)","v":""},null,{"$f":"IF(OR(AK30=\"\",$D30=\"\"),\"\",$D30*AK30*100)","v":""},null,{"$f":"IF(OR(AM30=\"\",$D30=\"\"),\"\",$D30*AM30*100)","v":""},null,{"$f":"IF(OR(AO30=\"\",$D30=\"\"),\"\",$D30*AO30*100)","v":""},null,{"$f":"IF(OR(AQ30=\"\",$D30=\"\"),\"\",$D30*AQ30*100)","v":""}]
[null,null,{"$f":"Daten!$A$143","v":"Zusammenzug aus Subkriterien:"},{"$f":"SUM(D32:D35)","v":0.15},null,{"$f":"IF(OR($D31=0,E$12=\"\"),\"\",SUM(F32:F35))","v":""},null,{"$f":"IF(OR($D31=0,G$12=\"\"),\"\",SUM(H32:H35))","v":""},null,{"$f":"IF(OR($D31=0,I$12=\"\"),\"\",SUM(J32:J35))","v":""},null,{"$f":"IF(OR($D31=0,K$12=\"\"),\"\",SUM(L32:L35))","v":""},null,{"$f":"IF(OR($D31=0,M$12=\"\"),\"\",SUM(N32:N35))","v":""},null,{"$f":"IF(OR($D31=0,O$12=\"\"),\"\",SUM(P32:P35))","v":""},null,{"$f":"IF(OR($D31=0,Q$12=\"\"),\"\",SUM(R32:R35))","v":""},null,{"$f":"IF(OR($D31=0,S$12=\"\"),\"\",SUM(T32:T35))","v":""},null,{"$f":"IF(OR($D31=0,U$12=\"\"),\"\",SUM(V32:V35))","v":""},null,{"$f":"IF(OR($D31=0,W$12=\"\"),\"\",SUM(X32:X35))","v":""},null,{"$f":"IF(OR($D31=0,Y$12=\"\"),\"\",SUM(Z32:Z35))","v":""},null,{"$f":"IF(OR($D31=0,AA$12=\"\"),\"\",SUM(AB32:AB35))","v":""},null,{"$f":"IF(OR($D31=0,AC$12=\"\"),\"\",SUM(AD32:AD35))","v":""},null,{"$f":"IF(OR($D31=0,AE$12=\"\"),\"\",SUM(AF32:AF35))","v":""},null,{"$f":"IF(OR($D31=0,AG$12=\"\"),\"\",SUM(AH32:AH35))","v":""},null,{"$f":"IF(OR($D31=0,AI$12=\"\"),\"\",SUM(AJ32:AJ35))","v":""},null,{"$f":"IF(OR($D31=0,AK$12=\"\"),\"\",SUM(AL32:AL35))","v":""},null,{"$f":"IF(OR($D31=0,AM$12=\"\"),\"\",SUM(AN32:AN35))","v":""},null,{"$f":"IF(OR($D31=0,AO$12=\"\"),\"\",SUM(AP32:AP35))","v":""},null,{"$f":"IF(OR($D31=0,AQ$12=\"\"),\"\",SUM(AR32:AR35))","v":""}]
[3.10,"Z3.7 Termingewährleistung",null,0.15,null,{"$f":"IF(OR(E32=\"\",$D32=\"\"),\"\",$D32*E32*100)","v":""},null,{"$f":"IF(OR(G32=\"\",$D32=\"\"),\"\",$D32*G32*100)","v":""},null,{"$f":"IF(OR(I32=\"\",$D32=\"\"),\"\",$D32*I32*100)","v":""},null,{"$f":"IF(OR(K32=\"\",$D32=\"\"),\"\",$D32*K32*100)","v":""},null,{"$f":"IF(OR(M32=\"\",$D32=\"\"),\"\",$D32*M32*100)","v":""},null,{"$f":"IF(OR(O32=\"\",$D32=\"\"),\"\",$D32*O32*100)","v":""},null,{"$f":"IF(OR(Q32=\"\",$D32=\"\"),\"\",$D32*Q32*100)","v":""},null,{"$f":"IF(OR(S32=\"\",$D32=\"\"),\"\",$D32*S32*100)","v":""},null,{"$f":"IF(OR(U32=\"\",$D32=\"\"),\"\",$D32*U32*100)","v":""},null,{"$f":"IF(OR(W32=\"\",$D32=\"\"),\"\",$D32*W32*100)","v":""},null,{"$f":"IF(OR(Y32=\"\",$D32=\"\"),\"\",$D32*Y32*100)","v":""},null,{"$f":"IF(OR(AA32=\"\",$D32=\"\"),\"\",$D32*AA32*100)","v":""},null,{"$f":"IF(OR(AC32=\"\",$D32=\"\"),\"\",$D32*AC32*100)","v":""},null,{"$f":"IF(OR(AE32=\"\",$D32=\"\"),\"\",$D32*AE32*100)","v":""},null,{"$f":"IF(OR(AG32=\"\",$D32=\"\"),\"\",$D32*AG32*100)","v":""},null,{"$f":"IF(OR(AI32=\"\",$D32=\"\"),\"\",$D32*AI32*100)","v":""},null,{"$f":"IF(OR(AK32=\"\",$D32=\"\"),\"\",$D32*AK32*100)","v":""},null,{"$f":"IF(OR(AM32=\"\",$D32=\"\"),\"\",$D32*AM32*100)","v":""},null,{"$f":"IF(OR(AO32=\"\",$D32=\"\"),\"\",$D32*AO32*100)","v":""},null,{"$f":"IF(OR(AQ32=\"\",$D32=\"\"),\"\",$D32*AQ32*100)","v":""}]
["3.2",{"$nulls":4},{"$f":"IF(OR(E33=\"\",$D33=\"\"),\"\",$D33*E33*100)","v":""},null,{"$f":"IF(OR(G33=\"\",$D33=\"\"),\"\",$D33*G33*100)","v":""},null,{"$f":"IF(OR(I33=\"\",$D33=\"\"),\"\",$D33*I33*100)","v":""},null,{"$f":"IF(OR(K33=\"\",$D33=\"\"),\"\",$D33*K33*100)","v":""},null,{"$f":"IF(OR(M33=\"\",$D33=\"\"),\"\",$D33*M33*100)","v":""},null,{"$f":"IF(OR(O33=\"\",$D33=\"\"),\"\",$D33*O33*100)","v":""},null,{"$f":"IF(OR(Q33=\"\",$D33=\"\"),\"\",$D33*Q33*100)","v":""},null,{"$f":"IF(OR(S33=\"\",$D33=\"\"),\"\",$D33*S33*100)","v":""},null,{"$f":"IF(OR(U33=\"\",$D33=\"\"),\"\",$D33*U33*100)","v":""},null,{"$f":"IF(OR(W33=\"\",$D33=\"\"),\"\",$D33*W33*100)","v":""},null,{"$f":"IF(OR(Y33=\"\",$D33=\"\"),\"\",$D33*Y33*100)","v":""},null,{"$f":"IF(OR(AA33=\"\",$D33=\"\"),\"\",$D33*AA33*100)","v":""},null,{"$f":"IF(OR(AC33=\"\",$D33=\"\"),\"\",$D33*AC33*100)","v":""},null,{"$f":"IF(OR(AE33=\"\",$D33=\"\"),\"\",$D33*AE33*100)","v":""},null,{"$f":"IF(OR(AG33=\"\",$D33=\"\"),\"\",$D33*AG33*100)","v":""},null,{"$f":"IF(OR(AI33=\"\",$D33=\"\"),\"\",$D33*AI33*100)","v":""},null,{"$f":"IF(OR(AK33=\"\",$D33=\"\"),\"\",$D33*AK33*100)","v":""},null,{"$f":"IF(OR(AM33=\"\",$D33=\"\"),\"\",$D33*AM33*100)","v":""},null,{"$f":"IF(OR(AO33=\"\",$D33=\"\"),\"\",$D33*AO33*100)","v":""},null,{"$f":"IF(OR(AQ33=\"\",$D33=\"\"),\"\",$D33*AQ33*100)","v":""}]
["3.3",{"$nulls":4},{"$f":"IF(OR(E34=\"\",$D34=\"\"),\"\",$D34*E34*100)","v":""},null,{"$f":"IF(OR(G34=\"\",$D34=\"\"),\"\",$D34*G34*100)","v":""},null,{"$f":"IF(OR(I34=\"\",$D34=\"\"),\"\",$D34*I34*100)","v":""},null,{"$f":"IF(OR(K34=\"\",$D34=\"\"),\"\",$D34*K34*100)","v":""},null,{"$f":"IF(OR(M34=\"\",$D34=\"\"),\"\",$D34*M34*100)","v":""},null,{"$f":"IF(OR(O34=\"\",$D34=\"\"),\"\",$D34*O34*100)","v":""},null,{"$f":"IF(OR(Q34=\"\",$D34=\"\"),\"\",$D34*Q34*100)","v":""},null,{"$f":"IF(OR(S34=\"\",$D34=\"\"),\"\",$D34*S34*100)","v":""},null,{"$f":"IF(OR(U34=\"\",$D34=\"\"),\"\",$D34*U34*100)","v":""},null,{"$f":"IF(OR(W34=\"\",$D34=\"\"),\"\",$D34*W34*100)","v":""},null,{"$f":"IF(OR(Y34=\"\",$D34=\"\"),\"\",$D34*Y34*100)","v":""},null,{"$f":"IF(OR(AA34=\"\",$D34=\"\"),\"\",$D34*AA34*100)","v":""},null,{"$f":"IF(OR(AC34=\"\",$D34=\"\"),\"\",$D34*AC34*100)","v":""},null,{"$f":"IF(OR(AE34=\"\",$D34=\"\"),\"\",$D34*AE34*100)","v":""},null,{"$f":"IF(OR(AG34=\"\",$D34=\"\"),\"\",$D34*AG34*100)","v":""},null,{"$f":"IF(OR(AI34=\"\",$D34=\"\"),\"\",$D34*AI34*100)","v":""},null,{"$f":"IF(OR(AK34=\"\",$D34=\"\"),\"\",$D34*AK34*100)","v":""},null,{"$f":"IF(OR(AM34=\"\",$D34=\"\"),\"\",$D34*AM34*100)","v":""},null,{"$f":"IF(OR(AO34=\"\",$D34=\"\"),\"\",$D34*AO34*100)","v":""},null,{"$f":"IF(OR(AQ34=\"\",$D34=\"\"),\"\",$D34*AQ34*100)","v":""}]
["3.4",{"$nulls":4},{"$f":"IF(OR(E35=\"\",$D35=\"\"),\"\",$D35*E35*100)","v":""},null,{"$f":"IF(OR(G35=\"\",$D35=\"\"),\"\",$D35*G35*100)","v":""},null,{"$f":"IF(OR(I35=\"\",$D35=\"\"),\"\",$D35*I35*100)","v":""},null,{"$f":"IF(OR(K35=\"\",$D35=\"\"),\"\",$D35*K35*100)","v":""},null,{"$f":"IF(OR(M35=\"\",$D35=\"\"),\"\",$D35*M35*100)","v":""},null,{"$f":"IF(OR(O35=\"\",$D35=\"\"),\"\",$D35*O35*100)","v":""},null,{"$f":"IF(OR(Q35=\"\",$D35=\"\"),\"\",$D35*Q35*100)","v":""},null,{"$f":"IF(OR(S35=\"\",$D35=\"\"),\"\",$D35*S35*100)","v":""},null,{"$f":"IF(OR(U35=\"\",$D35=\"\"),\"\",$D35*U35*100)","v":""},null,{"$f":"IF(OR(W35=\"\",$D35=\"\"),\"\",$D35*W35*100)","v":""},null,{"$f":"IF(OR(Y35=\"\",$D35=\"\"),\"\",$D35*Y35*100)","v":""},null,{"$f":"IF(OR(AA35=\"\",$D35=\"\"),\"\",$D35*AA35*100)","v":""},null,{"$f":"IF(OR(AC35=\"\",$D35=\"\"),\"\",$D35*AC35*100)","v":""},null,{"$f":"IF(OR(AE35=\"\",$D35=\"\"),\"\",$D35*AE35*100)","v":""},null,{"$f":"IF(OR(AG35=\"\",$D35=\"\"),\"\",$D35*AG35*100)","v":""},null,{"$f":"IF(OR(AI35=\"\",$D35=\"\"),\"\",$D35*AI35*100)","v":""},null,{"$f":"IF(OR(AK35=\"\",$D35=\"\"),\"\",$D35*AK35*100)","v":""},null,{"$f":"IF(OR(AM35=\"\",$D35=\"\"),\"\",$D35*AM35*100)","v":""},null,{"$f":"IF(OR(AO35=\"\",$D35=\"\"),\"\",$D35*AO35*100)","v":""},null,{"$f":"IF(OR(AQ35=\"\",$D35=\"\"),\"\",$D35*AQ35*100)","v":""}]
[]
["4",{"$nulls":4},{"$f":"IF(OR(E37=\"\",$D37=\"\"),\"\",$D37*E37*100)","v":""},null,{"$f":"IF(OR(G37=\"\",$D37=\"\"),\"\",$D37*G37*100)","v":""},null,{"$f":"IF(OR(I37=\"\",$D37=\"\"),\"\",$D37*I37*100)","v":""},null,{"$f":"IF(OR(K37=\"\",$D37=\"\"),\"\",$D37*K37*100)","v":""},null,{"$f":"IF(OR(M37=\"\",$D37=\"\"),\"\",$D37*M37*100)","v":""},null,{"$f":"IF(OR(O37=\"\",$D37=\"\"),\"\",$D37*O37*100)","v":""},null,{"$f":"IF(OR(Q37=\"\",$D37=\"\"),\"\",$D37*Q37*100)","v":""},null,{"$f":"IF(OR(S37=\"\",$D37=\"\"),\"\",$D37*S37*100)","v":""},null,{"$f":"IF(OR(U37=\"\",$D37=\"\"),\"\",$D37*U37*100)","v":""},null,{"$f":"IF(OR(W37=\"\",$D37=\"\"),\"\",$D37*W37*100)","v":""},null,{"$f":"IF(OR(Y37=\"\",$D37=\"\"),\"\",$D37*Y37*100)","v":""},null,{"$f":"IF(OR(AA37=\"\",$D37=\"\"),\"\",$D37*AA37*100)","v":""},null,{"$f":"IF(OR(AC37=\"\",$D37=\"\"),\"\",$D37*AC37*100)","v":""},null,{"$f":"IF(OR(AE37=\"\",$D37=\"\"),\"\",$D37*AE37*100)","v":""},null,{"$f":"IF(OR(AG37=\"\",$D37=\"\"),\"\",$D37*AG37*100)","v":""},null,{"$f":"IF(OR(AI37=\"\",$D37=\"\"),\"\",$D37*AI37*100)","v":""},null,{"$f":"IF(OR(AK37=\"\",$D37=\"\"),\"\",$D37*AK37*100)","v":""},null,{"$f":"IF(OR(AM37=\"\",$D37=\"\"),\"\",$D37*AM37*100)","v":""},null,{"$f":"IF(OR(AO37=\"\",$D37=\"\"),\"\",$D37*AO37*100)","v":""},null,{"$f":"IF(OR(AQ37=\"\",$D37=\"\"),\"\",$D37*AQ37*100)","v":""}]
[null,null,{"$f":"Daten!$A$143","v":"Zusammenzug aus Subkriterien:"},{"$f":"SUM(D39:D42)","v":0},null,{"$f":"IF(OR($D38=0,E$12=\"\"),\"\",SUM(F39:F42))","v":""},null,{"$f":"IF(OR($D38=0,G$12=\"\"),\"\",SUM(H39:H42))","v":""},null,{"$f":"IF(OR($D38=0,I$12=\"\"),\"\",SUM(J39:J42))","v":""},null,{"$f":"IF(OR($D38=0,K$12=\"\"),\"\",SUM(L39:L42))","v":""},null,{"$f":"IF(OR($D38=0,M$12=\"\"),\"\",SUM(N39:N42))","v":""},null,{"$f":"IF(OR($D38=0,O$12=\"\"),\"\",SUM(P39:P42))","v":""},null,{"$f":"IF(OR($D38=0,Q$12=\"\"),\"\",SUM(R39:R42))","v":""},null,{"$f":"IF(OR($D38=0,S$12=\"\"),\"\",SUM(T39:T42))","v":""},null,{"$f":"IF(OR($D38=0,U$12=\"\"),\"\",SUM(V39:V42))","v":""},null,{"$f":"IF(OR($D38=0,W$12=\"\"),\"\",SUM(X39:X42))","v":""},null,{"$f":"IF(OR($D38=0,Y$12=\"\"),\"\",SUM(Z39:Z42))","v":""},null,{"$f":"IF(OR($D38=0,AA$12=\"\"),\"\",SUM(AB39:AB42))","v":""},null,{"$f":"IF(OR($D38=0,AC$12=\"\"),\"\",SUM(AD39:AD42))","v":""},null,{"$f":"IF(OR($D38=0,AE$12=\"\"),\"\",SUM(AF39:AF42))","v":""},null,{"$f":"IF(OR($D38=0,AG$12=\"\"),\"\",SUM(AH39:AH42))","v":""},null,{"$f":"IF(OR($D38=0,AI$12=\"\"),\"\",SUM(AJ39:AJ42))","v":""},null,{"$f":"IF(OR($D38=0,AK$12=\"\"),\"\",SUM(AL39:AL42))","v":""},null,{"$f":"IF(OR($D38=0,AM$12=\"\"),\"\",SUM(AN39:AN42))","v":""},null,{"$f":"IF(OR($D38=0,AO$12=\"\"),\"\",SUM(AP39:AP42))","v":""},null,{"$f":"IF(OR($D38=0,AQ$12=\"\"),\"\",SUM(AR39:AR42))","v":""}]
["4.1",{"$nulls":4},{"$f":"IF(OR(E39=\"\",$D39=\"\"),\"\",$D39*E39*100)","v":""},null,{"$f":"IF(OR(G39=\"\",$D39=\"\"),\"\",$D39*G39*100)","v":""},null,{"$f":"IF(OR(I39=\"\",$D39=\"\"),\"\",$D39*I39*100)","v":""},null,{"$f":"IF(OR(K39=\"\",$D39=\"\"),\"\",$D39*K39*100)","v":""},null,{"$f":"IF(OR(M39=\"\",$D39=\"\"),\"\",$D39*M39*100)","v":""},null,{"$f":"IF(OR(O39=\"\",$D39=\"\"),\"\",$D39*O39*100)","v":""},null,{"$f":"IF(OR(Q39=\"\",$D39=\"\"),\"\",$D39*Q39*100)","v":""},null,{"$f":"IF(OR(S39=\"\",$D39=\"\"),\"\",$D39*S39*100)","v":""},null,{"$f":"IF(OR(U39=\"\",$D39=\"\"),\"\",$D39*U39*100)","v":""},null,{"$f":"IF(OR(W39=\"\",$D39=\"\"),\"\",$D39*W39*100)","v":""},null,{"$f":"IF(OR(Y39=\"\",$D39=\"\"),\"\",$D39*Y39*100)","v":""},null,{"$f":"IF(OR(AA39=\"\",$D39=\"\"),\"\",$D39*AA39*100)","v":""},null,{"$f":"IF(OR(AC39=\"\",$D39=\"\"),\"\",$D39*AC39*100)","v":""},null,{"$f":"IF(OR(AE39=\"\",$D39=\"\"),\"\",$D39*AE39*100)","v":""},null,{"$f":"IF(OR(AG39=\"\",$D39=\"\"),\"\",$D39*AG39*100)","v":""},null,{"$f":"IF(OR(AI39=\"\",$D39=\"\"),\"\",$D39*AI39*100)","v":""},null,{"$f":"IF(OR(AK39=\"\",$D39=\"\"),\"\",$D39*AK39*100)","v":""},null,{"$f":"IF(OR(AM39=\"\",$D39=\"\"),\"\",$D39*AM39*100)","v":""},null,{"$f":"IF(OR(AO39=\"\",$D39=\"\"),\"\",$D39*AO39*100)","v":""},null,{"$f":"IF(OR(AQ39=\"\",$D39=\"\"),\"\",$D39*AQ39*100)","v":""}]
["4.2",{"$nulls":4},{"$f":"IF(OR(E40=\"\",$D40=\"\"),\"\",$D40*E40*100)","v":""},null,{"$f":"IF(OR(G40=\"\",$D40=\"\"),\"\",$D40*G40*100)","v":""},null,{"$f":"IF(OR(I40=\"\",$D40=\"\"),\"\",$D40*I40*100)","v":""},null,{"$f":"IF(OR(K40=\"\",$D40=\"\"),\"\",$D40*K40*100)","v":""},null,{"$f":"IF(OR(M40=\"\",$D40=\"\"),\"\",$D40*M40*100)","v":""},null,{"$f":"IF(OR(O40=\"\",$D40=\"\"),\"\",$D40*O40*100)","v":""},null,{"$f":"IF(OR(Q40=\"\",$D40=\"\"),\"\",$D40*Q40*100)","v":""},null,{"$f":"IF(OR(S40=\"\",$D40=\"\"),\"\",$D40*S40*100)","v":""},null,{"$f":"IF(OR(U40=\"\",$D40=\"\"),\"\",$D40*U40*100)","v":""},null,{"$f":"IF(OR(W40=\"\",$D40=\"\"),\"\",$D40*W40*100)","v":""},null,{"$f":"IF(OR(Y40=\"\",$D40=\"\"),\"\",$D40*Y40*100)","v":""},null,{"$f":"IF(OR(AA40=\"\",$D40=\"\"),\"\",$D40*AA40*100)","v":""},null,{"$f":"IF(OR(AC40=\"\",$D40=\"\"),\"\",$D40*AC40*100)","v":""},null,{"$f":"IF(OR(AE40=\"\",$D40=\"\"),\"\",$D40*AE40*100)","v":""},null,{"$f":"IF(OR(AG40=\"\",$D40=\"\"),\"\",$D40*AG40*100)","v":""},null,{"$f":"IF(OR(AI40=\"\",$D40=\"\"),\"\",$D40*AI40*100)","v":""},null,{"$f":"IF(OR(AK40=\"\",$D40=\"\"),\"\",$D40*AK40*100)","v":""},null,{"$f":"IF(OR(AM40=\"\",$D40=\"\"),\"\",$D40*AM40*100)","v":""},null,{"$f":"IF(OR(AO40=\"\",$D40=\"\"),\"\",$D40*AO40*100)","v":""},null,{"$f":"IF(OR(AQ40=\"\",$D40=\"\"),\"\",$D40*AQ40*100)","v":""}]
["4.3",{"$nulls":4},{"$f":"IF(OR(E41=\"\",$D41=\"\"),\"\",$D41*E41*100)","v":""},null,{"$f":"IF(OR(G41=\"\",$D41=\"\"),\"\",$D41*G41*100)","v":""},null,{"$f":"IF(OR(I41=\"\",$D41=\"\"),\"\",$D41*I41*100)","v":""},null,{"$f":"IF(OR(K41=\"\",$D41=\"\"),\"\",$D41*K41*100)","v":""},null,{"$f":"IF(OR(M41=\"\",$D41=\"\"),\"\",$D41*M41*100)","v":""},null,{"$f":"IF(OR(O41=\"\",$D41=\"\"),\"\",$D41*O41*100)","v":""},null,{"$f":"IF(OR(Q41=\"\",$D41=\"\"),\"\",$D41*Q41*100)","v":""},null,{"$f":"IF(OR(S41=\"\",$D41=\"\"),\"\",$D41*S41*100)","v":""},null,{"$f":"IF(OR(U41=\"\",$D41=\"\"),\"\",$D41*U41*100)","v":""},null,{"$f":"IF(OR(W41=\"\",$D41=\"\"),\"\",$D41*W41*100)","v":""},null,{"$f":"IF(OR(Y41=\"\",$D41=\"\"),\"\",$D41*Y41*100)","v":""},null,{"$f":"IF(OR(AA41=\"\",$D41=\"\"),\"\",$D41*AA41*100)","v":""},null,{"$f":"IF(OR(AC41=\"\",$D41=\"\"),\"\",$D41*AC41*100)","v":""},null,{"$f":"IF(OR(AE41=\"\",$D41=\"\"),\"\",$D41*AE41*100)","v":""},null,{"$f":"IF(OR(AG41=\"\",$D41=\"\"),\"\",$D41*AG41*100)","v":""},null,{"$f":"IF(OR(AI41=\"\",$D41=\"\"),\"\",$D41*AI41*100)","v":""},null,{"$f":"IF(OR(AK41=\"\",$D41=\"\"),\"\",$D41*AK41*100)","v":""},null,{"$f":"IF(OR(AM41=\"\",$D41=\"\"),\"\",$D41*AM41*100)","v":""},null,{"$f":"IF(OR(AO41=\"\",$D41=\"\"),\"\",$D41*AO41*100)","v":""},null,{"$f":"IF(OR(AQ41=\"\",$D41=\"\"),\"\",$D41*AQ41*100)","v":""}]
["4.4",{"$nulls":4},{"$f":"IF(OR(E42=\"\",$D42=\"\"),\"\",$D42*E42*100)","v":""},null,{"$f":"IF(OR(G42=\"\",$D42=\"\"),\"\",$D42*G42*100)","v":""},null,{"$f":"IF(OR(I42=\"\",$D42=\"\"),\"\",$D42*I42*100)","v":""},null,{"$f":"IF(OR(K42=\"\",$D42=\"\"),\"\",$D42*K42*100)","v":""},null,{"$f":"IF(OR(M42=\"\",$D42=\"\"),\"\",$D42*M42*100)","v":""},null,{"$f":"IF(OR(O42=\"\",$D42=\"\"),\"\",$D42*O42*100)","v":""},null,{"$f":"IF(OR(Q42=\"\",$D42=\"\"),\"\",$D42*Q42*100)","v":""},null,{"$f":"IF(OR(S42=\"\",$D42=\"\"),\"\",$D42*S42*100)","v":""},null,{"$f":"IF(OR(U42=\"\",$D42=\"\"),\"\",$D42*U42*100)","v":""},null,{"$f":"IF(OR(W42=\"\",$D42=\"\"),\"\",$D42*W42*100)","v":""},null,{"$f":"IF(OR(Y42=\"\",$D42=\"\"),\"\",$D42*Y42*100)","v":""},null,{"$f":"IF(OR(AA42=\"\",$D42=\"\"),\"\",$D42*AA42*100)","v":""},null,{"$f":"IF(OR(AC42=\"\",$D42=\"\"),\"\",$D42*AC42*100)","v":""},null,{"$f":"IF(OR(AE42=\"\",$D42=\"\"),\"\",$D42*AE42*100)","v":""},null,{"$f":"IF(OR(AG42=\"\",$D42=\"\"),\"\",$D42*AG42*100)","v":""},null,{"$f":"IF(OR(AI42=\"\",$D42=\"\"),\"\",$D42*AI42*100)","v":""},null,{"$f":"IF(OR(AK42=\"\",$D42=\"\"),\"\",$D42*AK42*100)","v":""},null,{"$f":"IF(OR(AM42=\"\",$D42=\"\"),\"\",$D42*AM42*100)","v":""},null,{"$f":"IF(OR(AO42=\"\",$D42=\"\"),\"\",$D42*AO42*100)","v":""},null,{"$f":"IF(OR(AQ42=\"\",$D42=\"\"),\"\",$D42*AQ42*100)","v":""}]
[]
["5",{"$nulls":4},{"$f":"IF(OR(E44=\"\",$D44=\"\"),\"\",$D44*E44*100)","v":""},null,{"$f":"IF(OR(G44=\"\",$D44=\"\"),\"\",$D44*G44*100)","v":""},null,{"$f":"IF(OR(I44=\"\",$D44=\"\"),\"\",$D44*I44*100)","v":""},null,{"$f":"IF(OR(K44=\"\",$D44=\"\"),\"\",$D44*K44*100)","v":""},null,{"$f":"IF(OR(M44=\"\",$D44=\"\"),\"\",$D44*M44*100)","v":""},null,{"$f":"IF(OR(O44=\"\",$D44=\"\"),\"\",$D44*O44*100)","v":""},null,{"$f":"IF(OR(Q44=\"\",$D44=\"\"),\"\",$D44*Q44*100)","v":""},null,{"$f":"IF(OR(S44=\"\",$D44=\"\"),\"\",$D44*S44*100)","v":""},null,{"$f":"IF(OR(U44=\"\",$D44=\"\"),\"\",$D44*U44*100)","v":""},null,{"$f":"IF(OR(W44=\"\",$D44=\"\"),\"\",$D44*W44*100)","v":""},null,{"$f":"IF(OR(Y44=\"\",$D44=\"\"),\"\",$D44*Y44*100)","v":""},null,{"$f":"IF(OR(AA44=\"\",$D44=\"\"),\"\",$D44*AA44*100)","v":""},null,{"$f":"IF(OR(AC44=\"\",$D44=\"\"),\"\",$D44*AC44*100)","v":""},null,{"$f":"IF(OR(AE44=\"\",$D44=\"\"),\"\",$D44*AE44*100)","v":""},null,{"$f":"IF(OR(AG44=\"\",$D44=\"\"),\"\",$D44*AG44*100)","v":""},null,{"$f":"IF(OR(AI44=\"\",$D44=\"\"),\"\",$D44*AI44*100)","v":""},null,{"$f":"IF(OR(AK44=\"\",$D44=\"\"),\"\",$D44*AK44*100)","v":""},null,{"$f":"IF(OR(AM44=\"\",$D44=\"\"),\"\",$D44*AM44*100)","v":""},null,{"$f":"IF(OR(AO44=\"\",$D44=\"\"),\"\",$D44*AO44*100)","v":""},null,{"$f":"IF(OR(AQ44=\"\",$D44=\"\"),\"\",$D44*AQ44*100)","v":""}]
[null,null,{"$f":"Daten!$A$143","v":"Zusammenzug aus Subkriterien:"},{"$f":"SUM(D46:D47)","v":0},null,{"$f":"IF(OR($D45=0,E$12=\"\"),\"\",SUM(F46:F47))","v":""},null,{"$f":"IF(OR($D45=0,G$12=\"\"),\"\",SUM(H46:H47))","v":""},null,{"$f":"IF(OR($D45=0,I$12=\"\"),\"\",SUM(J46:J47))","v":""},null,{"$f":"IF(OR($D45=0,K$12=\"\"),\"\",SUM(L46:L47))","v":""},null,{"$f":"IF(OR($D45=0,M$12=\"\"),\"\",SUM(N46:N47))","v":""},null,{"$f":"IF(OR($D45=0,O$12=\"\"),\"\",SUM(P46:P47))","v":""},null,{"$f":"IF(OR($D45=0,Q$12=\"\"),\"\",SUM(R46:R47))","v":""},null,{"$f":"IF(OR($D45=0,S$12=\"\"),\"\",SUM(T46:T47))","v":""},null,{"$f":"IF(OR($D45=0,U$12=\"\"),\"\",SUM(V46:V47))","v":""},null,{"$f":"IF(OR($D45=0,W$12=\"\"),\"\",SUM(X46:X47))","v":""},null,{"$f":"IF(OR($D45=0,Y$12=\"\"),\"\",SUM(Z46:Z47))","v":""},null,{"$f":"IF(OR($D45=0,AA$12=\"\"),\"\",SUM(AB46:AB47))","v":""},null,{"$f":"IF(OR($D45=0,AC$12=\"\"),\"\",SUM(AD46:AD47))","v":""},null,{"$f":"IF(OR($D45=0,AE$12=\"\"),\"\",SUM(AF46:AF47))","v":""},null,{"$f":"IF(OR($D45=0,AG$12=\"\"),\"\",SUM(AH46:AH47))","v":""},null,{"$f":"IF(OR($D45=0,AI$12=\"\"),\"\",SUM(AJ46:AJ47))","v":""},null,{"$f":"IF(OR($D45=0,AK$12=\"\"),\"\",SUM(AL46:AL47))","v":""},null,{"$f":"IF(OR($D45=0,AM$12=\"\"),\"\",SUM(AN46:AN47))","v":""},null,{"$f":"IF(OR($D45=0,AO$12=\"\"),\"\",SUM(AP46:AP47))","v":""},null,{"$f":"IF(OR($D45=0,AQ$12=\"\"),\"\",SUM(AR46:AR47))","v":""}]
["5.1",{"$nulls":4},{"$f":"IF(OR(E46=\"\",$D46=\"\"),\"\",$D46*E46*100)","v":""},null,{"$f":"IF(OR(G46=\"\",$D46=\"\"),\"\",$D46*G46*100)","v":""},null,{"$f":"IF(OR(I46=\"\",$D46=\"\"),\"\",$D46*I46*100)","v":""},null,{"$f":"IF(OR(K46=\"\",$D46=\"\"),\"\",$D46*K46*100)","v":""},null,{"$f":"IF(OR(M46=\"\",$D46=\"\"),\"\",$D46*M46*100)","v":""},null,{"$f":"IF(OR(O46=\"\",$D46=\"\"),\"\",$D46*O46*100)","v":""},null,{"$f":"IF(OR(Q46=\"\",$D46=\"\"),\"\",$D46*Q46*100)","v":""},null,{"$f":"IF(OR(S46=\"\",$D46=\"\"),\"\",$D46*S46*100)","v":""},null,{"$f":"IF(OR(U46=\"\",$D46=\"\"),\"\",$D46*U46*100)","v":""},null,{"$f":"IF(OR(W46=\"\",$D46=\"\"),\"\",$D46*W46*100)","v":""},null,{"$f":"IF(OR(Y46=\"\",$D46=\"\"),\"\",$D46*Y46*100)","v":""},null,{"$f":"IF(OR(AA46=\"\",$D46=\"\"),\"\",$D46*AA46*100)","v":""},null,{"$f":"IF(OR(AC46=\"\",$D46=\"\"),\"\",$D46*AC46*100)","v":""},null,{"$f":"IF(OR(AE46=\"\",$D46=\"\"),\"\",$D46*AE46*100)","v":""},null,{"$f":"IF(OR(AG46=\"\",$D46=\"\"),\"\",$D46*AG46*100)","v":""},null,{"$f":"IF(OR(AI46=\"\",$D46=\"\"),\"\",$D46*AI46*100)","v":""},null,{"$f":"IF(OR(AK46=\"\",$D46=\"\"),\"\",$D46*AK46*100)","v":""},null,{"$f":"IF(OR(AM46=\"\",$D46=\"\"),\"\",$D46*AM46*100)","v":""},null,{"$f":"IF(OR(AO46=\"\",$D46=\"\"),\"\",$D46*AO46*100)","v":""},null,{"$f":"IF(OR(AQ46=\"\",$D46=\"\"),\"\",$D46*AQ46*100)","v":""}]
["5.2",{"$nulls":4},{"$f":"IF(OR(E47=\"\",$D47=\"\"),\"\",$D47*E47*100)","v":""},null,{"$f":"IF(OR(G47=\"\",$D47=\"\"),\"\",$D47*G47*100)","v":""},null,{"$f":"IF(OR(I47=\"\",$D47=\"\"),\"\",$D47*I47*100)","v":""},null,{"$f":"IF(OR(K47=\"\",$D47=\"\"),\"\",$D47*K47*100)","v":""},null,{"$f":"IF(OR(M47=\"\",$D47=\"\"),\"\",$D47*M47*100)","v":""},null,{"$f":"IF(OR(O47=\"\",$D47=\"\"),\"\",$D47*O47*100)","v":""},null,{"$f":"IF(OR(Q47=\"\",$D47=\"\"),\"\",$D47*Q47*100)","v":""},null,{"$f":"IF(OR(S47=\"\",$D47=\"\"),\"\",$D47*S47*100)","v":""},null,{"$f":"IF(OR(U47=\"\",$D47=\"\"),\"\",$D47*U47*100)","v":""},null,{"$f":"IF(OR(W47=\"\",$D47=\"\"),\"\",$D47*W47*100)","v":""},null,{"$f":"IF(OR(Y47=\"\",$D47=\"\"),\"\",$D47*Y47*100)","v":""},null,{"$f":"IF(OR(AA47=\"\",$D47=\"\"),\"\",$D47*AA47*100)","v":""},null,{"$f":"IF(OR(AC47=\"\",$D47=\"\"),\"\",$D47*AC47*100)","v":""},null,{"$f":"IF(OR(AE47=\"\",$D47=\"\"),\"\",$D47*AE47*100)","v":""},null,{"$f":"IF(OR(AG47=\"\",$D47=\"\"),\"\",$D47*AG47*100)","v":""},null,{"$f":"IF(OR(AI47=\"\",$D47=\"\"),\"\",$D47*AI47*100)","v":""},null,{"$f":"IF(OR(AK47=\"\",$D47=\"\"),\"\",$D47*AK47*100)","v":""},null,{"$f":"IF(OR(AM47=\"\",$D47=\"\"),\"\",$D47*AM47*100)","v":""},null,{"$f":"IF(OR(AO47=\"\",$D47=\"\"),\"\",$D47*AO47*100)","v":""},null,{"$f":"IF(OR(AQ47=\"\",$D47=\"\"),\"\",$D47*AQ47*100)","v":""}]
[]
["6",{"$nulls":4},{"$f":"IF(OR(E49=\"\",$D49=\"\"),\"\",$D49*E49*100)","v":""},null,{"$f":"IF(OR(G49=\"\",$D49=\"\"),\"\",$D49*G49*100)","v":""},null,{"$f":"IF(OR(I49=\"\",$D49=\"\"),\"\",$D49*I49*100)","v":""},null,{"$f":"IF(OR(K49=\"\",$D49=\"\"),\"\",$D49*K49*100)","v":""},null,{"$f":"IF(OR(M49=\"\",$D49=\"\"),\"\",$D49*M49*100)","v":""},null,{"$f":"IF(OR(O49=\"\",$D49=\"\"),\"\",$D49*O49*100)","v":""},null,{"$f":"IF(OR(Q49=\"\",$D49=\"\"),\"\",$D49*Q49*100)","v":""},null,{"$f":"IF(OR(S49=\"\",$D49=\"\"),\"\",$D49*S49*100)","v":""},null,{"$f":"IF(OR(U49=\"\",$D49=\"\"),\"\",$D49*U49*100)","v":""},null,{"$f":"IF(OR(W49=\"\",$D49=\"\"),\"\",$D49*W49*100)","v":""},null,{"$f":"IF(OR(Y49=\"\",$D49=\"\"),\"\",$D49*Y49*100)","v":""},null,{"$f":"IF(OR(AA49=\"\",$D49=\"\"),\"\",$D49*AA49*100)","v":""},null,{"$f":"IF(OR(AC49=\"\",$D49=\"\"),\"\",$D49*AC49*100)","v":""},null,{"$f":"IF(OR(AE49=\"\",$D49=\"\"),\"\",$D49*AE49*100)","v":""},null,{"$f":"IF(OR(AG49=\"\",$D49=\"\"),\"\",$D49*AG49*100)","v":""},null,{"$f":"IF(OR(AI49=\"\",$D49=\"\"),\"\",$D49*AI49*100)","v":""},null,{"$f":"IF(OR(AK49=\"\",$D49=\"\"),\"\",$D49*AK49*100)","v":""},null,{"$f":"IF(OR(AM49=\"\",$D49=\"\"),\"\",$D49*AM49*100)","v":""},null,{"$f":"IF(OR(AO49=\"\",$D49=\"\"),\"\",$D49*AO49*100)","v":""},null,{"$f":"IF(OR(AQ49=\"\",$D49=\"\"),\"\",$D49*AQ49*100)","v":""}]
[null,null,{"$f":"Daten!$A$143","v":"Zusammenzug aus Subkriterien:"},{"$f":"SUM(D51:D52)","v":0},null,{"$f":"IF(OR($D50=0,E$12=\"\"),\"\",SUM(F51:F52))","v":""},null,{"$f":"IF(OR($D50=0,G$12=\"\"),\"\",SUM(H51:H52))","v":""},null,{"$f":"IF(OR($D50=0,I$12=\"\"),\"\",SUM(J51:J52))","v":""},null,{"$f":"IF(OR($D50=0,K$12=\"\"),\"\",SUM(L51:L52))","v":""},null,{"$f":"IF(OR($D50=0,M$12=\"\"),\"\",SUM(N51:N52))","v":""},null,{"$f":"IF(OR($D50=0,O$12=\"\"),\"\",SUM(P51:P52))","v":""},null,{"$f":"IF(OR($D50=0,Q$12=\"\"),\"\",SUM(R51:R52))","v":""},null,{"$f":"IF(OR($D50=0,S$12=\"\"),\"\",SUM(T51:T52))","v":""},null,{"$f":"IF(OR($D50=0,U$12=\"\"),\"\",SUM(V51:V52))","v":""},null,{"$f":"IF(OR($D50=0,W$12=\"\"),\"\",SUM(X51:X52))","v":""},null,{"$f":"IF(OR($D50=0,Y$12=\"\"),\"\",SUM(Z51:Z52))","v":""},null,{"$f":"IF(OR($D50=0,AA$12=\"\"),\"\",SUM(AB51:AB52))","v":""},null,{"$f":"IF(OR($D50=0,AC$12=\"\"),\"\",SUM(AD51:AD52))","v":""},null,{"$f":"IF(OR($D50=0,AE$12=\"\"),\"\",SUM(AF51:AF52))","v":""},null,{"$f":"IF(OR($D50=0,AG$12=\"\"),\"\",SUM(AH51:AH52))","v":""},null,{"$f":"IF(OR($D50=0,AI$12=\"\"),\"\",SUM(AJ51:AJ52))","v":""},null,{"$f":"IF(OR($D50=0,AK$12=\"\"),\"\",SUM(AL51:AL52))","v":""},null,{"$f":"IF(OR($D50=0,AM$12=\"\"),\"\",SUM(AN51:AN52))","v":""},null,{"$f":"IF(OR($D50=0,AO$12=\"\"),\"\",SUM(AP51:AP52))","v":""},null,{"$f":"IF(OR($D50=0,AQ$12=\"\"),\"\",SUM(AR51:AR52))","v":""}]
["6.1",{"$nulls":4},{"$f":"IF(OR(E51=\"\",$D51=\"\"),\"\",$D51*E51*100)","v":""},null,{"$f":"IF(OR(G51=\"\",$D51=\"\"),\"\",$D51*G51*100)","v":""},null,{"$f":"IF(OR(I51=\"\",$D51=\"\"),\"\",$D51*I51*100)","v":""},null,{"$f":"IF(OR(K51=\"\",$D51=\"\"),\"\",$D51*K51*100)","v":""},null,{"$f":"IF(OR(M51=\"\",$D51=\"\"),\"\",$D51*M51*100)","v":""},null,{"$f":"IF(OR(O51=\"\",$D51=\"\"),\"\",$D51*O51*100)","v":""},null,{"$f":"IF(OR(Q51=\"\",$D51=\"\"),\"\",$D51*Q51*100)","v":""},null,{"$f":"IF(OR(S51=\"\",$D51=\"\"),\"\",$D51*S51*100)","v":""},null,{"$f":"IF(OR(U51=\"\",$D51=\"\"),\"\",$D51*U51*100)","v":""},null,{"$f":"IF(OR(W51=\"\",$D51=\"\"),\"\",$D51*W51*100)","v":""},null,{"$f":"IF(OR(Y51=\"\",$D51=\"\"),\"\",$D51*Y51*100)","v":""},null,{"$f":"IF(OR(AA51=\"\",$D51=\"\"),\"\",$D51*AA51*100)","v":""},null,{"$f":"IF(OR(AC51=\"\",$D51=\"\"),\"\",$D51*AC51*100)","v":""},null,{"$f":"IF(OR(AE51=\"\",$D51=\"\"),\"\",$D51*AE51*100)","v":""},null,{"$f":"IF(OR(AG51=\"\",$D51=\"\"),\"\",$D51*AG51*100)","v":""},null,{"$f":"IF(OR(AI51=\"\",$D51=\"\"),\"\",$D51*AI51*100)","v":""},null,{"$f":"IF(OR(AK51=\"\",$D51=\"\"),\"\",$D51*AK51*100)","v":""},null,{"$f":"IF(OR(AM51=\"\",$D51=\"\"),\"\",$D51*AM51*100)","v":""},null,{"$f":"IF(OR(AO51=\"\",$D51=\"\"),\"\",$D51*AO51*100)","v":""},null,{"$f":"IF(OR(AQ51=\"\",$D51=\"\"),\"\",$D51*AQ51*100)","v":""}]
["6.2",{"$nulls":4},{"$f":"IF(OR(E52=\"\",$D52=\"\"),\"\",$D52*E52*100)","v":""},null,{"$f":"IF(OR(G52=\"\",$D52=\"\"),\"\",$D52*G52*100)","v":""},null,{"$f":"IF(OR(I52=\"\",$D52=\"\"),\"\",$D52*I52*100)","v":""},null,{"$f":"IF(OR(K52=\"\",$D52=\"\"),\"\",$D52*K52*100)","v":""},null,{"$f":"IF(OR(M52=\"\",$D52=\"\"),\"\",$D52*M52*100)","v":""},null,{"$f":"IF(OR(O52=\"\",$D52=\"\"),\"\",$D52*O52*100)","v":""},null,{"$f":"IF(OR(Q52=\"\",$D52=\"\"),\"\",$D52*Q52*100)","v":""},null,{"$f":"IF(OR(S52=\"\",$D52=\"\"),\"\",$D52*S52*100)","v":""},null,{"$f":"IF(OR(U52=\"\",$D52=\"\"),\"\",$D52*U52*100)","v":""},null,{"$f":"IF(OR(W52=\"\",$D52=\"\"),\"\",$D52*W52*100)","v":""},null,{"$f":"IF(OR(Y52=\"\",$D52=\"\"),\"\",$D52*Y52*100)","v":""},null,{"$f":"IF(OR(AA52=\"\",$D52=\"\"),\"\",$D52*AA52*100)","v":""},null,{"$f":"IF(OR(AC52=\"\",$D52=\"\"),\"\",$D52*AC52*100)","v":""},null,{"$f":"IF(OR(AE52=\"\",$D52=\"\"),\"\",$D52*AE52*100)","v":""},null,{"$f":"IF(OR(AG52=\"\",$D52=\"\"),\"\",$D52*AG52*100)","v":""},null,{"$f":"IF(OR(AI52=\"\",$D52=\"\"),\"\",$D52*AI52*100)","v":""},null,{"$f":"IF(OR(AK52=\"\",$D52=\"\"),\"\",$D52*AK52*100)","v":""},null,{"$f":"IF(OR(AM52=\"\",$D52=\"\"),\"\",$D52*AM52*100)","v":""},null,{"$f":"IF(OR(AO52=\"\",$D52=\"\"),\"\",$D52*AO52*100)","v":""},null,{"$f":"IF(OR(AQ52=\"\",$D52=\"\"),\"\",$D52*AQ52*100)","v":""}]
[]
["7",{"$nulls":4},{"$f":"IF(OR(E54=\"\",$D54=\"\"),\"\",$D54*E54*100)","v":""},null,{"$f":"IF(OR(G54=\"\",$D54=\"\"),\"\",$D54*G54*100)","v":""},null,{"$f":"IF(OR(I54=\"\",$D54=\"\"),\"\",$D54*I54*100)","v":""},null,{"$f":"IF(OR(K54=\"\",$D54=\"\"),\"\",$D54*K54*100)","v":""},null,{"$f":"IF(OR(M54=\"\",$D54=\"\"),\"\",$D54*M54*100)","v":""},null,{"$f":"IF(OR(O54=\"\",$D54=\"\"),\"\",$D54*O54*100)","v":""},null,{"$f":"IF(OR(Q54=\"\",$D54=\"\"),\"\",$D54*Q54*100)","v":""},null,{"$f":"IF(OR(S54=\"\",$D54=\"\"),\"\",$D54*S54*100)","v":""},null,{"$f":"IF(OR(U54=\"\",$D54=\"\"),\"\",$D54*U54*100)","v":""},null,{"$f":"IF(OR(W54=\"\",$D54=\"\"),\"\",$D54*W54*100)","v":""},null,{"$f":"IF(OR(Y54=\"\",$D54=\"\"),\"\",$D54*Y54*100)","v":""},null,{"$f":"IF(OR(AA54=\"\",$D54=\"\"),\"\",$D54*AA54*100)","v":""},null,{"$f":"IF(OR(AC54=\"\",$D54=\"\"),\"\",$D54*AC54*100)","v":""},null,{"$f":"IF(OR(AE54=\"\",$D54=\"\"),\"\",$D54*AE54*100)","v":""},null,{"$f":"IF(OR(AG54=\"\",$D54=\"\"),\"\",$D54*AG54*100)","v":""},null,{"$f":"IF(OR(AI54=\"\",$D54=\"\"),\"\",$D54*AI54*100)","v":""},null,{"$f":"IF(OR(AK54=\"\",$D54=\"\"),\"\",$D54*AK54*100)","v":""},null,{"$f":"IF(OR(AM54=\"\",$D54=\"\"),\"\",$D54*AM54*100)","v":""},null,{"$f":"IF(OR(AO54=\"\",$D54=\"\"),\"\",$D54*AO54*100)","v":""},null,{"$f":"IF(OR(AQ54=\"\",$D54=\"\"),\"\",$D54*AQ54*100)","v":""}]
[null,null,{"$f":"Daten!$A$143","v":"Zusammenzug aus Subkriterien:"},{"$f":"SUM(D56:D57)","v":0},null,{"$f":"IF(OR($D55=0,E$12=\"\"),\"\",SUM(F56:F57))","v":""},null,{"$f":"IF(OR($D55=0,G$12=\"\"),\"\",SUM(H56:H57))","v":""},null,{"$f":"IF(OR($D55=0,I$12=\"\"),\"\",SUM(J56:J57))","v":""},null,{"$f":"IF(OR($D55=0,K$12=\"\"),\"\",SUM(L56:L57))","v":""},null,{"$f":"IF(OR($D55=0,M$12=\"\"),\"\",SUM(N56:N57))","v":""},null,{"$f":"IF(OR($D55=0,O$12=\"\"),\"\",SUM(P56:P57))","v":""},null,{"$f":"IF(OR($D55=0,Q$12=\"\"),\"\",SUM(R56:R57))","v":""},null,{"$f":"IF(OR($D55=0,S$12=\"\"),\"\",SUM(T56:T57))","v":""},null,{"$f":"IF(OR($D55=0,U$12=\"\"),\"\",SUM(V56:V57))","v":""},null,{"$f":"IF(OR($D55=0,W$12=\"\"),\"\",SUM(X56:X57))","v":""},null,{"$f":"IF(OR($D55=0,Y$12=\"\"),\"\",SUM(Z56:Z57))","v":""},null,{"$f":"IF(OR($D55=0,AA$12=\"\"),\"\",SUM(AB56:AB57))","v":""},null,{"$f":"IF(OR($D55=0,AC$12=\"\"),\"\",SUM(AD56:AD57))","v":""},null,{"$f":"IF(OR($D55=0,AE$12=\"\"),\"\",SUM(AF56:AF57))","v":""},null,{"$f":"IF(OR($D55=0,AG$12=\"\"),\"\",SUM(AH56:AH57))","v":""},null,{"$f":"IF(OR($D55=0,AI$12=\"\"),\"\",SUM(AJ56:AJ57))","v":""},null,{"$f":"IF(OR($D55=0,AK$12=\"\"),\"\",SUM(AL56:AL57))","v":""},null,{"$f":"IF(OR($D55=0,AM$12=\"\"),\"\",SUM(AN56:AN57))","v":""},null,{"$f":"IF(OR($D55=0,AO$12=\"\"),\"\",SUM(AP56:AP57))","v":""},null,{"$f":"IF(OR($D55=0,AQ$12=\"\"),\"\",SUM(AR56:AR57))","v":""}]
["7.1",{"$nulls":4},{"$f":"IF(OR(E56=\"\",$D56=\"\"),\"\",$D56*E56*100)","v":""},null,{"$f":"IF(OR(G56=\"\",$D56=\"\"),\"\",$D56*G56*100)","v":""},null,{"$f":"IF(OR(I56=\"\",$D56=\"\"),\"\",$D56*I56*100)","v":""},null,{"$f":"IF(OR(K56=\"\",$D56=\"\"),\"\",$D56*K56*100)","v":""},null,{"$f":"IF(OR(M56=\"\",$D56=\"\"),\"\",$D56*M56*100)","v":""},null,{"$f":"IF(OR(O56=\"\",$D56=\"\"),\"\",$D56*O56*100)","v":""},null,{"$f":"IF(OR(Q56=\"\",$D56=\"\"),\"\",$D56*Q56*100)","v":""},null,{"$f":"IF(OR(S56=\"\",$D56=\"\"),\"\",$D56*S56*100)","v":""},null,{"$f":"IF(OR(U56=\"\",$D56=\"\"),\"\",$D56*U56*100)","v":""},null,{"$f":"IF(OR(W56=\"\",$D56=\"\"),\"\",$D56*W56*100)","v":""},null,{"$f":"IF(OR(Y56=\"\",$D56=\"\"),\"\",$D56*Y56*100)","v":""},null,{"$f":"IF(OR(AA56=\"\",$D56=\"\"),\"\",$D56*AA56*100)","v":""},null,{"$f":"IF(OR(AC56=\"\",$D56=\"\"),\"\",$D56*AC56*100)","v":""},null,{"$f":"IF(OR(AE56=\"\",$D56=\"\"),\"\",$D56*AE56*100)","v":""},null,{"$f":"IF(OR(AG56=\"\",$D56=\"\"),\"\",$D56*AG56*100)","v":""},null,{"$f":"IF(OR(AI56=\"\",$D56=\"\"),\"\",$D56*AI56*100)","v":""},null,{"$f":"IF(OR(AK56=\"\",$D56=\"\"),\"\",$D56*AK56*100)","v":""},null,{"$f":"IF(OR(AM56=\"\",$D56=\"\"),\"\",$D56*AM56*100)","v":""},null,{"$f":"IF(OR(AO56=\"\",$D56=\"\"),\"\",$D56*AO56*100)","v":""},null,{"$f":"IF(OR(AQ56=\"\",$D56=\"\"),\"\",$D56*AQ56*100)","v":""}]
["7.2",{"$nulls":4},{"$f":"IF(OR(E57=\"\",$D57=\"\"),\"\",$D57*E57*100)","v":""},null,{"$f":"IF(OR(G57=\"\",$D57=\"\"),\"\",$D57*G57*100)","v":""},null,{"$f":"IF(OR(I57=\"\",$D57=\"\"),\"\",$D57*I57*100)","v":""},null,{"$f":"IF(OR(K57=\"\",$D57=\"\"),\"\",$D57*K57*100)","v":""},null,{"$f":"IF(OR(M57=\"\",$D57=\"\"),\"\",$D57*M57*100)","v":""},null,{"$f":"IF(OR(O57=\"\",$D57=\"\"),\"\",$D57*O57*100)","v":""},null,{"$f":"IF(OR(Q57=\"\",$D57=\"\"),\"\",$D57*Q57*100)","v":""},null,{"$f":"IF(OR(S57=\"\",$D57=\"\"),\"\",$D57*S57*100)","v":""},null,{"$f":"IF(OR(U57=\"\",$D57=\"\"),\"\",$D57*U57*100)","v":""},null,{"$f":"IF(OR(W57=\"\",$D57=\"\"),\"\",$D57*W57*100)","v":""},null,{"$f":"IF(OR(Y57=\"\",$D57=\"\"),\"\",$D57*Y57*100)","v":""},null,{"$f":"IF(OR(AA57=\"\",$D57=\"\"),\"\",$D57*AA57*100)","v":""},null,{"$f":"IF(OR(AC57=\"\",$D57=\"\"),\"\",$D57*AC57*100)","v":""},null,{"$f":"IF(OR(AE57=\"\",$D57=\"\"),\"\",$D57*AE57*100)","v":""},null,{"$f":"IF(OR(AG57=\"\",$D57=\"\"),\"\",$D57*AG57*100)","v":""},null,{"$f":"IF(OR(AI57=\"\",$D57=\"\"),\"\",$D57*AI57*100)","v":""},null,{"$f":"IF(OR(AK57=\"\",$D57=\"\"),\"\",$D57*AK57*100)","v":""},null,{"$f":"IF(OR(AM57=\"\",$D57=\"\"),\"\",$D57*AM57*100)","v":""},null,{"$f":"IF(OR(AO57=\"\",$D57=\"\"),\"\",$D57*AO57*100)","v":""},null,{"$f":"IF(OR(AQ57=\"\",$D57=\"\"),\"\",$D57*AQ57*100)","v":""}]
[]
["8",{"$nulls":4},{"$f":"IF(OR(E59=\"\",$D59=\"\"),\"\",$D59*E59*100)","v":""},null,{"$f":"IF(OR(G59=\"\",$D59=\"\"),\"\",$D59*G59*100)","v":""},null,{"$f":"IF(OR(I59=\"\",$D59=\"\"),\"\",$D59*I59*100)","v":""},null,{"$f":"IF(OR(K59=\"\",$D59=\"\"),\"\",$D59*K59*100)","v":""},null,{"$f":"IF(OR(M59=\"\",$D59=\"\"),\"\",$D59*M59*100)","v":""},null,{"$f":"IF(OR(O59=\"\",$D59=\"\"),\"\",$D59*O59*100)","v":""},null,{"$f":"IF(OR(Q59=\"\",$D59=\"\"),\"\",$D59*Q59*100)","v":""},null,{"$f":"IF(OR(S59=\"\",$D59=\"\"),\"\",$D59*S59*100)","v":""},null,{"$f":"IF(OR(U59=\"\",$D59=\"\"),\"\",$D59*U59*100)","v":""},null,{"$f":"IF(OR(W59=\"\",$D59=\"\"),\"\",$D59*W59*100)","v":""},null,{"$f":"IF(OR(Y59=\"\",$D59=\"\"),\"\",$D59*Y59*100)","v":""},null,{"$f":"IF(OR(AA59=\"\",$D59=\"\"),\"\",$D59*AA59*100)","v":""},null,{"$f":"IF(OR(AC59=\"\",$D59=\"\"),\"\",$D59*AC59*100)","v":""},null,{"$f":"IF(OR(AE59=\"\",$D59=\"\"),\"\",$D59*AE59*100)","v":""},null,{"$f":"IF(OR(AG59=\"\",$D59=\"\"),\"\",$D59*AG59*100)","v":""},null,{"$f":"IF(OR(AI59=\"\",$D59=\"\"),\"\",$D59*AI59*100)","v":""},null,{"$f":"IF(OR(AK59=\"\",$D59=\"\"),\"\",$D59*AK59*100)","v":""},null,{"$f":"IF(OR(AM59=\"\",$D59=\"\"),\"\",$D59*AM59*100)","v":""},null,{"$f":"IF(OR(AO59=\"\",$D59=\"\"),\"\",$D59*AO59*100)","v":""},null,{"$f":"IF(OR(AQ59=\"\",$D59=\"\"),\"\",$D59*AQ59*100)","v":""}]
[null,null,{"$f":"Daten!$A$143","v":"Zusammenzug aus Subkriterien:"},{"$f":"SUM(D61:D62)","v":0},null,{"$f":"IF(OR($D60=0,E$12=\"\"),\"\",SUM(F61:F62))","v":""},null,{"$f":"IF(OR($D60=0,G$12=\"\"),\"\",SUM(H61:H62))","v":""},null,{"$f":"IF(OR($D60=0,I$12=\"\"),\"\",SUM(J61:J62))","v":""},null,{"$f":"IF(OR($D60=0,K$12=\"\"),\"\",SUM(L61:L62))","v":""},null,{"$f":"IF(OR($D60=0,M$12=\"\"),\"\",SUM(N61:N62))","v":""},null,{"$f":"IF(OR($D60=0,O$12=\"\"),\"\",SUM(P61:P62))","v":""},null,{"$f":"IF(OR($D60=0,Q$12=\"\"),\"\",SUM(R61:R62))","v":""},null,{"$f":"IF(OR($D60=0,S$12=\"\"),\"\",SUM(T61:T62))","v":""},null,{"$f":"IF(OR($D60=0,U$12=\"\"),\"\",SUM(V61:V62))","v":""},null,{"$f":"IF(OR($D60=0,W$12=\"\"),\"\",SUM(X61:X62))","v":""},null,{"$f":"IF(OR($D60=0,Y$12=\"\"),\"\",SUM(Z61:Z62))","v":""},null,{"$f":"IF(OR($D60=0,AA$12=\"\"),\"\",SUM(AB61:AB62))","v":""},null,{"$f":"IF(OR($D60=0,AC$12=\"\"),\"\",SUM(AD61:AD62))","v":""},null,{"$f":"IF(OR($D60=0,AE$12=\"\"),\"\",SUM(AF61:AF62))","v":""},null,{"$f":"IF(OR($D60=0,AG$12=\"\"),\"\",SUM(AH61:AH62))","v":""},null,{"$f":"IF(OR($D60=0,AI$12=\"\"),\"\",SUM(AJ61:AJ62))","v":""},null,{"$f":"IF(OR($D60=0,AK$12=\"\"),\"\",SUM(AL61:AL62))","v":""},null,{"$f":"IF(OR($D60=0,AM$12=\"\"),\"\",SUM(AN61:AN62))","v":""},null,{"$f":"IF(OR($D60=0,AO$12=\"\"),\"\",SUM(AP61:AP62))","v":""},null,{"$f":"IF(OR($D60=0,AQ$12=\"\"),\"\",SUM(AR61:AR62))","v":""}]
["8.1",{"$nulls":4},{"$f":"IF(OR(E61=\"\",$D61=\"\"),\"\",$D61*E61*100)","v":""},null,{"$f":"IF(OR(G61=\"\",$D61=\"\"),\"\",$D61*G61*100)","v":""},null,{"$f":"IF(OR(I61=\"\",$D61=\"\"),\"\",$D61*I61*100)","v":""},null,{"$f":"IF(OR(K61=\"\",$D61=\"\"),\"\",$D61*K61*100)","v":""},null,{"$f":"IF(OR(M61=\"\",$D61=\"\"),\"\",$D61*M61*100)","v":""},null,{"$f":"IF(OR(O61=\"\",$D61=\"\"),\"\",$D61*O61*100)","v":""},null,{"$f":"IF(OR(Q61=\"\",$D61=\"\"),\"\",$D61*Q61*100)","v":""},null,{"$f":"IF(OR(S61=\"\",$D61=\"\"),\"\",$D61*S61*100)","v":""},null,{"$f":"IF(OR(U61=\"\",$D61=\"\"),\"\",$D61*U61*100)","v":""},null,{"$f":"IF(OR(W61=\"\",$D61=\"\"),\"\",$D61*W61*100)","v":""},null,{"$f":"IF(OR(Y61=\"\",$D61=\"\"),\"\",$D61*Y61*100)","v":""},null,{"$f":"IF(OR(AA61=\"\",$D61=\"\"),\"\",$D61*AA61*100)","v":""},null,{"$f":"IF(OR(AC61=\"\",$D61=\"\"),\"\",$D61*AC61*100)","v":""},null,{"$f":"IF(OR(AE61=\"\",$D61=\"\"),\"\",$D61*AE61*100)","v":""},null,{"$f":"IF(OR(AG61=\"\",$D61=\"\"),\"\",$D61*AG61*100)","v":""},null,{"$f":"IF(OR(AI61=\"\",$D61=\"\"),\"\",$D61*AI61*100)","v":""},null,{"$f":"IF(OR(AK61=\"\",$D61=\"\"),\"\",$D61*AK61*100)","v":""},null,{"$f":"IF(OR(AM61=\"\",$D61=\"\"),\"\",$D61*AM61*100)","v":""},null,{"$f":"IF(OR(AO61=\"\",$D61=\"\"),\"\",$D61*AO61*100)","v":""},null,{"$f":"IF(OR(AQ61=\"\",$D61=\"\"),\"\",$D61*AQ61*100)","v":""}]
["8.2",{"$nulls":4},{"$f":"IF(OR(E62=\"\",$D62=\"\"),\"\",$D62*E62*100)","v":""},null,{"$f":"IF(OR(G62=\"\",$D62=\"\"),\"\",$D62*G62*100)","v":""},null,{"$f":"IF(OR(I62=\"\",$D62=\"\"),\"\",$D62*I62*100)","v":""},null,{"$f":"IF(OR(K62=\"\",$D62=\"\"),\"\",$D62*K62*100)","v":""},null,{"$f":"IF(OR(M62=\"\",$D62=\"\"),\"\",$D62*M62*100)","v":""},null,{"$f":"IF(OR(O62=\"\",$D62=\"\"),\"\",$D62*O62*100)","v":""},null,{"$f":"IF(OR(Q62=\"\",$D62=\"\"),\"\",$D62*Q62*100)","v":""},null,{"$f":"IF(OR(S62=\"\",$D62=\"\"),\"\",$D62*S62*100)","v":""},null,{"$f":"IF(OR(U62=\"\",$D62=\"\"),\"\",$D62*U62*100)","v":""},null,{"$f":"IF(OR(W62=\"\",$D62=\"\"),\"\",$D62*W62*100)","v":""},null,{"$f":"IF(OR(Y62=\"\",$D62=\"\"),\"\",$D62*Y62*100)","v":""},null,{"$f":"IF(OR(AA62=\"\",$D62=\"\"),\"\",$D62*AA62*100)","v":""},null,{"$f":"IF(OR(AC62=\"\",$D62=\"\"),\"\",$D62*AC62*100)","v":""},null,{"$f":"IF(OR(AE62=\"\",$D62=\"\"),\"\",$D62*AE62*100)","v":""},null,{"$f":"IF(OR(AG62=\"\",$D62=\"\"),\"\",$D62*AG62*100)","v":""},null,{"$f":"IF(OR(AI62=\"\",$D62=\"\"),\"\",$D62*AI62*100)","v":""},null,{"$f":"IF(OR(AK62=\"\",$D62=\"\"),\"\",$D62*AK62*100)","v":""},null,{"$f":"IF(OR(AM62=\"\",$D62=\"\"),\"\",$D62*AM62*100)","v":""},null,{"$f":"IF(OR(AO62=\"\",$D62=\"\"),\"\",$D62*AO62*100)","v":""},null,{"$f":"IF(OR(AQ62=\"\",$D62=\"\"),\"\",$D62*AQ62*100)","v":""}]
[{"$f":"Daten!A135","v":"Total, max. 500 Punkte"},null,null,{"$f":"SUM(D59:D60,D54:D55,D49:D50,D44:D45,D37:D38,D30:D31,D23:D24,D18)","v":1},{"$f":"IF(OR($D63=0,E$12=\"\",E13=Daten!$A146),\"\",SUM(F18,F23:F24,F30:F31,F37:F38,F44:F45,F49:F50,F54:F55,F59:F60))","v":""},null,{"$f":"IF(OR($D63=0,G$12=\"\",G13=Daten!$A146),\"\",SUM(H18,H23:H24,H30:H31,H37:H38,H44:H45,H49:H50,H54:H55,H59:H60))","v":""},null,{"$f":"IF(OR($D63=0,I$12=\"\",I13=Daten!$A146),\"\",SUM(J18,J23:J24,J30:J31,J37:J38,J44:J45,J49:J50,J54:J55,J59:J60))","v":""},null,{"$f":"IF(OR($D63=0,K$12=\"\",K13=Daten!$A146),\"\",SUM(L18,L23:L24,L30:L31,L37:L38,L44:L45,L49:L50,L54:L55,L59:L60))","v":""},null,{"$f":"IF(OR($D63=0,M$12=\"\",M13=Daten!$A146),\"\",SUM(N18,N23:N24,N30:N31,N37:N38,N44:N45,N49:N50,N54:N55,N59:N60))","v":""},null,{"$f":"IF(OR($D63=0,O$12=\"\",O13=Daten!$A146),\"\",SUM(P18,P23:P24,P30:P31,P37:P38,P44:P45,P49:P50,P54:P55,P59:P60))","v":""},null,{"$f":"IF(OR($D63=0,Q$12=\"\",Q13=Daten!$A146),\"\",SUM(R18,R23:R24,R30:R31,R37:R38,R44:R45,R49:R50,R54:R55,R59:R60))","v":""},null,{"$f":"IF(OR($D63=0,S$12=\"\",S13=Daten!$A146),\"\",SUM(T18,T23:T24,T30:T31,T37:T38,T44:T45,T49:T50,T54:T55,T59:T60))","v":""},null,{"$f":"IF(OR($D63=0,U$12=\"\",U13=Daten!$A146),\"\",SUM(V18,V23:V24,V30:V31,V37:V38,V44:V45,V49:V50,V54:V55,V59:V60))","v":""},null,{"$f":"IF(OR($D63=0,W$12=\"\",W13=Daten!$A146),\"\",SUM(X18,X23:X24,X30:X31,X37:X38,X44:X45,X49:X50,X54:X55,X59:X60))","v":""},null,{"$f":"IF(OR($D63=0,Y$12=\"\",Y13=Daten!$A146),\"\",SUM(Z18,Z23:Z24,Z30:Z31,Z37:Z38,Z44:Z45,Z49:Z50,Z54:Z55,Z59:Z60))","v":""},null,{"$f":"IF(OR($D63=0,AA$12=\"\",AA13=Daten!$A146),\"\",SUM(AB18,AB23:AB24,AB30:AB31,AB37:AB38,AB44:AB45,AB49:AB50,AB54:AB55,AB59:AB60))","v":""},null,{"$f":"IF(OR($D63=0,AC$12=\"\",AC13=Daten!$A146),\"\",SUM(AD18,AD23:AD24,AD30:AD31,AD37:AD38,AD44:AD45,AD49:AD50,AD54:AD55,AD59:AD60))","v":""},null,{"$f":"IF(OR($D63=0,AE$12=\"\",AE13=Daten!$A146),\"\",SUM(AF18,AF23:AF24,AF30:AF31,AF37:AF38,AF44:AF45,AF49:AF50,AF54:AF55,AF59:AF60))","v":""},null,{"$f":"IF(OR($D63=0,AG$12=\"\",AG13=Daten!$A146),\"\",SUM(AH18,AH23:AH24,AH30:AH31,AH37:AH38,AH44:AH45,AH49:AH50,AH54:AH55,AH59:AH60))","v":""},null,{"$f":"IF(OR($D63=0,AI$12=\"\",AI13=Daten!$A146),\"\",SUM(AJ18,AJ23:AJ24,AJ30:AJ31,AJ37:AJ38,AJ44:AJ45,AJ49:AJ50,AJ54:AJ55,AJ59:AJ60))","v":""},null,{"$f":"IF(OR($D63=0,AK$12=\"\",AK13=Daten!$A146),\"\",SUM(AL18,AL23:AL24,AL30:AL31,AL37:AL38,AL44:AL45,AL49:AL50,AL54:AL55,AL59:AL60))","v":""},null,{"$f":"IF(OR($D63=0,AM$12=\"\",AM13=Daten!$A146),\"\",SUM(AN18,AN23:AN24,AN30:AN31,AN37:AN38,AN44:AN45,AN49:AN50,AN54:AN55,AN59:AN60))","v":""},null,{"$f":"IF(OR($D63=0,AO$12=\"\",AO13=Daten!$A146),\"\",SUM(AP18,AP23:AP24,AP30:AP31,AP37:AP38,AP44:AP45,AP49:AP50,AP54:AP55,AP59:AP60))","v":""},null,{"$f":"IF(OR($D63=0,AQ$12=\"\",AQ13=Daten!$A146),\"\",SUM(AR18,AR23:AR24,AR30:AR31,AR37:AR38,AR44:AR45,AR49:AR50,AR54:AR55,AR59:AR60))","v":""}]
[]
[{"$nulls":4},{"$f":"Daten!A136","v":"Bewertungsskala:"},null,null,null,0,{"$f":"Daten!A137","v":"Nicht beurteilbar"},{"$nulls":4},2,{"$f":"Daten!A139","v":"Ungenügende Erfüllung"},{"$nulls":4},4,{"$f":"Daten!A141","v":"Gute Erfüllung"}]
[{"$nulls":8},1,{"$f":"Daten!A138","v":"Sehr schlechte Erfüllung"},{"$nulls":4},3,{"$f":"Daten!A140","v":"Genügende Erfüllung"},{"$nulls":4},5,{"$f":"Daten!A142","v":"Sehr gute Erfüllung"}]
[]
[{"$nulls":8},"↑",{"$f":"Daten!A182","v":"Nur ganze Zahlen"}]

{"sheet":"Bemerkungen Zuschlag","index":8,"n_rows":51,"n_cols":3,"rows_kept":51,"cut":false,"hidden":false,"merged":[[46,2,46,21],[48,2,48,21],[50,2,50,21],[34,2,34,21],[36,2,36,21],[38,2,38,21],[40,2,40,21],[42,2,42,21],[44,2,44,21],[32,2,32,21],[12,2,12,21],[14,2,14,21],[16,2,16,21],[18,2,18,21],[20,2,20,21],[22,2,22,21],[24,2,24,21],[26,2,26,21],[28,2,28,21],[30,2,30,21]]}
[]
[{"$f":"Daten!A35","v":"Bemerkungen Zuschlag"}]
[]
[{"$f":"Daten!A37&\":\"","v":"Projektnummer:"},null,{"$f":"CELL(\"inhalt\",Info!D4:F4)","v":0}]
[]
[{"$f":"Daten!A38&\":\"","v":"Projektbezeichnung:"},null,{"$f":"CELL(\"inhalt\",Info!K4:M8)","v":0}]
[]
[{"$f":"Daten!A40&\":\"","v":"Vertragsgegenstand:"},null,{"$f":"CELL(\"inhalt\",Info!K11:M15)","v":0}]
[]
[{"$f":"Daten!A144","v":"Bemerkungen zur Bewertung"}]
[{"$f":"Daten!A90","v":"Nr."},{"$f":"Daten!A121","v":"Anbieter"},{"$f":"Daten!A122","v":"Begründung"}]
[]
[1,{"$f":"Auswertungstabelle!C3","v":""}]
[]
[2,{"$f":"Auswertungstabelle!D3","v":""}]
[]
[3,{"$f":"Auswertungstabelle!E3","v":""}]
[]
[4,{"$f":"Auswertungstabelle!F3","v":""}]
[]
[5,{"$f":"Auswertungstabelle!G3","v":""}]
[]
[6,{"$f":"Auswertungstabelle!H3","v":""}]
[]
[7,{"$f":"Auswertungstabelle!I3","v":""}]
[]
[8,{"$f":"Auswertungstabelle!J3","v":""}]
[]
[9,{"$f":"Auswertungstabelle!K3","v":""}]
[]
[10,{"$f":"Auswertungstabelle!L3","v":""}]
[]
[11,{"$f":"Auswertungstabelle!M3","v":""}]
[]
[12,{"$f":"Auswertungstabelle!N3","v":""}]
[]
[13,{"$f":"Auswertungstabelle!O3","v":""}]
[]
[14,{"$f":"Auswertungstabelle!P3","v":""}]
[]
[15,{"$f":"Auswertungstabelle!Q3","v":""}]
[]
[16,{"$f":"Auswertungstabelle!R3","v":""}]
[]
[17,{"$f":"Auswertungstabelle!S3","v":""}]
[]
[18,{"$f":"Auswertungstabelle!T3","v":""}]
[]
[19,{"$f":"Auswertungstabelle!U3","v":""}]
[]
[20,{"$f":"Auswertungstabelle!V3","v":""}]

{"sheet":"Gesamt","index":9,"n_rows":63,"n_cols":22,"rows_kept":63,"cut":false,"hidden":false,"merged":[[56,2,56,21],[58,2,58,21],[60,2,60,21],[62,2,62,21],[44,2,44,21],[46,2,46,21],[48,2,48,21],[50,2,50,21],[52,2,52,21],[54,2,54,21],[42,2,42,21],[9,2,9,21],[24,2,24,21],[26,2,26,21],[28,2,28,21],[30,2,30,21],[32,2,32,21],[34,2,34,21],[36,2,36,21],[38,2,38,21],[40,2,40,21]]}
[]
[{"$f":"Daten!A78","v":"Gesamtbewertung"}]
[]
[{"$f":"Daten!A37&\":\"","v":"Projektnummer:"},null,{"$f":"CELL(\"inhalt\",Info!D4:F4)","v":0}]
[]
[{"$f":"Daten!A38&\":\"","v":"Projektbezeichnung:"},null,{"$f":"CELL(\"inhalt\",Info!K4:M8)","v":0}]
[]
[{"$f":"Daten!A40&\":\"","v":"Vertragsgegenstand:"},null,{"$f":"CELL(\"inhalt\",Info!K11:M15)","v":0}]
[]
[null,null,{"$f":"Daten!A113","v":"Anbieter (Nr. gemäss Offertöffnungprotokoll)"}]
[null,null,1,2,3,4,5,6,7,8,9,10,11,12,13,14,15,16,17,18,19,20]
[null,null,{"$f":"Auswertungstabelle!C28","v":""},{"$f":"Auswertungstabelle!D28","v":""},{"$f":"Auswertungstabelle!E28","v":""},{"$f":"Auswertungstabelle!F28","v":""},{"$f":"Auswertungstabelle!G28","v":""},{"$f":"Auswertungstabelle!H28","v":""},{"$f":"Auswertungstabelle!I28","v":""},{"$f":"Auswertungstabelle!J28","v":""},{"$f":"Auswertungstabelle!K28","v":""},{"$f":"Auswertungstabelle!L28","v":""},{"$f":"Auswertungstabelle!M28","v":""},{"$f":"Auswertungstabelle!N28","v":""},{"$f":"Auswertungstabelle!O28","v":""},{"$f":"Auswertungstabelle!P28","v":""},{"$f":"Auswertungstabelle!Q28","v":""},{"$f":"Auswertungstabelle!R28","v":""},{"$f":"Auswertungstabelle!S28","v":""},{"$f":"Auswertungstabelle!T28","v":""},{"$f":"Auswertungstabelle!U28","v":""},{"$f":"Auswertungstabelle!V28","v":""}]
[null,null,{"$f":"Auswertungstabelle!C29","v":""},{"$f":"Auswertungstabelle!D29","v":""},{"$f":"Auswertungstabelle!E29","v":""},{"$f":"Auswertungstabelle!F29","v":""},{"$f":"Auswertungstabelle!G29","v":""},{"$f":"Auswertungstabelle!H29","v":""},{"$f":"Auswertungstabelle!I29","v":""},{"$f":"Auswertungstabelle!J29","v":""},{"$f":"Auswertungstabelle!K29","v":""},{"$f":"Auswertungstabelle!L29","v":""},{"$f":"Auswertungstabelle!M29","v":""},{"$f":"Auswertungstabelle!N29","v":""},{"$f":"Auswertungstabelle!O29","v":""},{"$f":"Auswertungstabelle!P29","v":""},{"$f":"Auswertungstabelle!Q29","v":""},{"$f":"Auswertungstabelle!R29","v":""},{"$f":"Auswertungstabelle!S29","v":""},{"$f":"Auswertungstabelle!T29","v":""},{"$f":"Auswertungstabelle!U29","v":""},{"$f":"Auswertungstabelle!V29","v":""}]
[{"$f":"Daten!A159","v":"Punkte (Max 500)"},null,{"$f":"Auswertungstabelle!C30","v":""},{"$f":"Auswertungstabelle!D30","v":""},{"$f":"Auswertungstabelle!E30","v":""},{"$f":"Auswertungstabelle!F30","v":""},{"$f":"Auswertungstabelle!G30","v":""},{"$f":"Auswertungstabelle!H30","v":""},{"$f":"Auswertungstabelle!I30","v":""},{"$f":"Auswertungstabelle!J30","v":""},{"$f":"Auswertungstabelle!K30","v":""},{"$f":"Auswertungstabelle!L30","v":""},{"$f":"Auswertungstabelle!M30","v":""},{"$f":"Auswertungstabelle!N30","v":""},{"$f":"Auswertungstabelle!O30","v":""},{"$f":"Auswertungstabelle!P30","v":""},{"$f":"Auswertungstabelle!Q30","v":""},{"$f":"Auswertungstabelle!R30","v":""},{"$f":"Auswertungstabelle!S30","v":""},{"$f":"Auswertungstabelle!T30","v":""},{"$f":"Auswertungstabelle!U30","v":""},{"$f":"Auswertungstabelle!V30","v":""}]
[{"$f":"Daten!A160","v":"Rang"},null,{"$f":"Auswertungstabelle!C32","v":""},{"$f":"Auswertungstabelle!D32","v":""},{"$f":"Auswertungstabelle!E32","v":""},{"$f":"Auswertungstabelle!F32","v":""},{"$f":"Auswertungstabelle!G32","v":""},{"$f":"Auswertungstabelle!H32","v":""},{"$f":"Auswertungstabelle!I32","v":""},{"$f":"Auswertungstabelle!J32","v":""},{"$f":"Auswertungstabelle!K32","v":""},{"$f":"Auswertungstabelle!L32","v":""},{"$f":"Auswertungstabelle!M32","v":""},{"$f":"Auswertungstabelle!N32","v":""},{"$f":"Auswertungstabelle!O32","v":""},{"$f":"Auswertungstabelle!P32","v":""},{"$f":"Auswertungstabelle!Q32","v":""},{"$f":"Auswertungstabelle!R32","v":""},{"$f":"Auswertungstabelle!S32","v":""},{"$f":"Auswertungstabelle!T32","v":""},{"$f":"Auswertungstabelle!U32","v":""},{"$f":"Auswertungstabelle!V32","v":""}]
[{"$f":"Daten!A161","v":"in Prozenten, bezogen auf erreichte Punkte"},null,{"$f":"Auswertungstabelle!C33","v":""},{"$f":"Auswertungstabelle!D33","v":""},{"$f":"Auswertungstabelle!E33","v":""},{"$f":"Auswertungstabelle!F33","v":""},{"$f":"Auswertungstabelle!G33","v":""},{"$f":"Auswertungstabelle!H33","v":""},{"$f":"Auswertungstabelle!I33","v":""},{"$f":"Auswertungstabelle!J33","v":""},{"$f":"Auswertungstabelle!K33","v":""},{"$f":"Auswertungstabelle!L33","v":""},{"$f":"Auswertungstabelle!M33","v":""},{"$f":"Auswertungstabelle!N33","v":""},{"$f":"Auswertungstabelle!O33","v":""},{"$f":"Auswertungstabelle!P33","v":""},{"$f":"Auswertungstabelle!Q33","v":""},{"$f":"Auswertungstabelle!R33","v":""},{"$f":"Auswertungstabelle!S33","v":""},{"$f":"Auswertungstabelle!T33","v":""},{"$f":"Auswertungstabelle!U33","v":""},{"$f":"Auswertungstabelle!V33","v":""}]
[null,null,{"$f":"IF(Auswertungstabelle!X50=\"Achtung\",Daten!A179,\"\")","v":""}]
[{"$f":"Daten!A162","v":"Prüfpunkte"}]
[{"$f":"Daten!A163","v":"Keine wesentlichen Formfehler"},null,{"$f":"Auswertungstabelle!C35","v":""},{"$f":"Auswertungstabelle!D35","v":""},{"$f":"Auswertungstabelle!E35","v":""},{"$f":"Auswertungstabelle!F35","v":""},{"$f":"Auswertungstabelle!G35","v":""},{"$f":"Auswertungstabelle!H35","v":""},{"$f":"Auswertungstabelle!I35","v":""},{"$f":"Auswertungstabelle!J35","v":""},{"$f":"Auswertungstabelle!K35","v":""},{"$f":"Auswertungstabelle!L35","v":""},{"$f":"Auswertungstabelle!M35","v":""},{"$f":"Auswertungstabelle!N35","v":""},{"$f":"Auswertungstabelle!O35","v":""},{"$f":"Auswertungstabelle!P35","v":""},{"$f":"Auswertungstabelle!Q35","v":""},{"$f":"Auswertungstabelle!R35","v":""},{"$f":"Auswertungstabelle!S35","v":""},{"$f":"Auswertungstabelle!T35","v":""},{"$f":"Auswertungstabelle!U35","v":""},{"$f":"Auswertungstabelle!V35","v":""}]
[{"$f":"Daten!A164","v":"Eignungskriterien erfüllt"},null,{"$f":"Auswertungstabelle!C36","v":""},{"$f":"Auswertungstabelle!D36","v":""},{"$f":"Auswertungstabelle!E36","v":""},{"$f":"Auswertungstabelle!F36","v":""},{"$f":"Auswertungstabelle!G36","v":""},{"$f":"Auswertungstabelle!H36","v":""},{"$f":"Auswertungstabelle!I36","v":""},{"$f":"Auswertungstabelle!J36","v":""},{"$f":"Auswertungstabelle!K36","v":""},{"$f":"Auswertungstabelle!L36","v":""},{"$f":"Auswertungstabelle!M36","v":""},{"$f":"Auswertungstabelle!N36","v":""},{"$f":"Auswertungstabelle!O36","v":""},{"$f":"Auswertungstabelle!P36","v":""},{"$f":"Auswertungstabelle!Q36","v":""},{"$f":"Auswertungstabelle!R36","v":""},{"$f":"Auswertungstabelle!S36","v":""},{"$f":"Auswertungstabelle!T36","v":""},{"$f":"Auswertungstabelle!U36","v":""},{"$f":"Auswertungstabelle!V36","v":""}]
[]
[{"$f":"Daten!A165","v":"Bemerkungen zur Gesamtbewertung"}]
[{"$f":"Daten!A90","v":"Nr."},{"$f":"Daten!A121","v":"Anbieter"},{"$f":"Daten!A122","v":"Begründung"}]
[]
[{"$f":"C11","v":1},{"$f":"Auswertungstabelle!C44","v":""}]
[]
[{"$f":"D11","v":2},{"$f":"Auswertungstabelle!D44","v":""}]
[]
[{"$f":"E11","v":3},{"$f":"Auswertungstabelle!E44","v":""}]
[]
[{"$f":"F11","v":4},{"$f":"Auswertungstabelle!F44","v":""}]
[]
[{"$f":"G11","v":5},{"$f":"Auswertungstabelle!G44","v":""}]
[]
[{"$f":"H11","v":6},{"$f":"Auswertungstabelle!H44","v":""}]
[]
[{"$f":"I11","v":7},{"$f":"Auswertungstabelle!I44","v":""}]
[]
[{"$f":"J11","v":8},{"$f":"Auswertungstabelle!J44","v":""}]
[]
[{"$f":"K11","v":9},{"$f":"Auswertungstabelle!K44","v":""}]
[]
[{"$f":"L11","v":10},{"$f":"Auswertungstabelle!L44","v":""}]
[]
[{"$f":"M11","v":11},{"$f":"Auswertungstabelle!M44","v":""}]
[]
[{"$f":"N11","v":12},{"$f":"Auswertungstabelle!N44","v":""}]
[]
[{"$f":"O11","v":13},{"$f":"Auswertungstabelle!O44","v":""}]
[]
[{"$f":"P11","v":14},{"$f":"Auswertungstabelle!P44","v":""}]
[]
[{"$f":"Q11","v":15},{"$f":"Auswertungstabelle!Q44","v":""}]
[]
[{"$f":"R11","v":16},{"$f":"Auswertungstabelle!R44","v":""}]
[]
[{"$f":"S11","v":17},{"$f":"Auswertungstabelle!S44","v":""}]
[]
[{"$f":"T11","v":18},{"$f":"Auswertungstabelle!T44","v":""}]
[]
[{"$f":"U11","v":19},{"$f":"Auswertungstabelle!U44","v":""}]
[]
[{"$f":"V11","v":20},{"$f":"Auswertungstabelle!V44","v":""}]

{"sheet":"Antrag","index":10,"n_rows":58,"n_cols":14,"rows_kept":58,"cut":false,"hidden":false,"merged":[[11,0,14,13],[24,0,27,13],[37,11,37,13],[47,11,47,13],[57,11,57,13],[31,3,31,5],[33,3,33,5],[31,0,35,2],[35,3,35,5],[41,0,47,5],[51,0,57,5],[37,7,37,9],[57,7,57,9]]}
[]
[{"$f":"Daten!A30","v":"Antrag"}]
[]
[{"$f":"Daten!A37&\":\"","v":"Projektnummer:"},null,null,{"$f":"CELL(\"inhalt\",Info!D4:F4)","v":0}]
[]
[{"$f":"Daten!A38&\":\"","v":"Projektbezeichnung:"},null,null,{"$f":"CELL(\"inhalt\",Info!K4:M8)","v":0}]
[]
[{"$f":"Daten!A40&\":\"","v":"Vertragsgegenstand:"},null,null,{"$f":"CELL(\"inhalt\",Info!K11:M15)","v":0}]
[]
[{"$f":"Daten!A74","v":"Ausgangslage"}]
[]
[]
[]
[]
[]
[]
[{"$f":"Daten!A75","v":"Projektinformationen"}]
[]
[{"$f":"Daten!A76&\":\"","v":"Vergabeverfahren:"},null,null,{"$f":"IF(Info!D26=\"\",\"\",Info!D26)","v":""},null,null,null,{"$f":"Daten!A47&\":\"","v":"Der Vergabe entsprechender KV:"},{"$nulls":4},"CHF"]
[]
[{"$nulls":7},{"$f":"Daten!A77&\":\"","v":"Vergabesumme (Rundung: CHF 0.05):"},{"$nulls":4},"CHF",{"$f":"Auswertungstabelle!X60","v":""}]
[]
[{"$f":"Daten!A78","v":"Gesamtbewertung"}]
[]
[]
[]
[]
[]
[]
[{"$f":"Daten!A30","v":"Antrag"}]
[]
[{"$f":"Daten!A80","v":"Aufgrund der besten Gesamt-\nwirtschaftlichkeit beantragen wir\ndie Vergabe an die Firma/ARGE:"},null,null,{"$f":"IF(Auswertungstabelle!X53=0,\"\",Auswertungstabelle!X53)","v":""},null,null,null,{"$f":"Daten!A81","v":"Datum/Unterschrift:"},null,null,null,{"$f":"Daten!A81","v":"Datum/Unterschrift:"}]
[]
[null,null,null,{"$f":"IF(Auswertungstabelle!X54=0,\"\",Auswertungstabelle!X54)","v":""}]
[]
[null,null,null,{"$f":"IF(Auswertungstabelle!X55=\"0 0\",\"\",Auswertungstabelle!X55)","v":""}]
[]
[{"$nulls":7},{"$f":"Daten!A86","v":"Name + Funktion"},null,null,null,{"$f":"Daten!A86","v":"Name + Funktion"}]
[]
[{"$f":"Daten!A85","v":"Stellungnahme"}]
[]
[{"$nulls":7},{"$f":"Daten!A83","v":"Vertrag geprüft"},null,null,null,{"$f":"Daten!A81","v":"Datum/Unterschrift:"}]
[]
[{"$nulls":7},{"$f":"Daten!A84","v":"Vergabeantrag geprüft"}]
[]
[]
[]
[{"$nulls":11},{"$f":"Daten!A86","v":"Name + Funktion"}]
[]
[{"$f":"Daten!A82","v":"Genehmigung"}]
[]
[{"$nulls":7},{"$f":"Daten!A81","v":"Datum/Unterschrift:"},null,null,null,{"$f":"Daten!A81","v":"Datum/Unterschrift:"}]
[]
[]
[]
[]
[]
[{"$nulls":7},{"$f":"Daten!A86","v":"Name + Funktion"},null,null,null,{"$f":"Daten!A86","v":"Name + Funktion"}]

{"sheet":"Auswertungstabelle","index":11,"n_rows":60,"n_cols":25,"rows_kept":60,"cut":false,"hidden":true,"merged":[]}
["Zusammenzug"]
[null,"von wo genommen (Blatt)?",1,2,3,4,5,6,7,8,9,10,11,12,13,14,15,16,17,18,19,20]
[null,"Offertöffnung",{"$f":"IF(Offertöffnung!B18=\"\",\"\",Offertöffnung!B18)","v":""},{"$f":"IF(Offertöffnung!B19=\"\",\"\",Offertöffnung!B19)","v":""},{"$f":"IF(Offertöffnung!B20=\"\",\"\",Offertöffnung!B20)","v":""},{"$f":"IF(Offertöffnung!B21=\"\",\"\",Offertöffnung!B21)","v":""},{"$f":"IF(Offertöffnung!B22=\"\",\"\",Offertöffnung!B22)","v":""},{"$f":"IF(Offertöffnung!B23=\"\",\"\",Offertöffnung!B23)","v":""},{"$f":"IF(Offertöffnung!B24=\"\",\"\",Offertöffnung!B24)","v":""},{"$f":"IF(Offertöffnung!B25=\"\",\"\",Offertöffnung!B25)","v":""},{"$f":"IF(Offertöffnung!B26=\"\",\"\",Offertöffnung!B26)","v":""},{"$f":"IF(Offertöffnung!B27=\"\",\"\",Offertöffnung!B27)","v":""},{"$f":"IF(Offertöffnung!B28=\"\",\"\",Offertöffnung!B28)","v":""},{"$f":"IF(Offertöffnung!B29=\"\",\"\",Offertöffnung!B29)","v":""},{"$f":"IF(Offertöffnung!B30=\"\",\"\",Offertöffnung!B30)","v":""},{"$f":"IF(Offertöffnung!B31=\"\",\"\",Offertöffnung!B31)","v":""},{"$f":"IF(Offertöffnung!B32=\"\",\"\",Offertöffnung!B32)","v":""},{"$f":"IF(Offertöffnung!B33=\"\",\"\",Offertöffnung!B33)","v":""},{"$f":"IF(Offertöffnung!B34=\"\",\"\",Offertöffnung!B34)","v":""},{"$f":"IF(Offertöffnung!B35=\"\",\"\",Offertöffnung!B35)","v":""},{"$f":"IF(Offertöffnung!B36=\"\",\"\",Offertöffnung!B36)","v":""},{"$f":"IF(Offertöffnung!B37=\"\",\"\",Offertöffnung!B37)","v":""}]
["Eingaben gemäss Offertöffnung","Offertöffnung",{"$f":"TRANSPOSE(Offertöffnung!I18:I37)","v":0},0,0,0,0,0,0,0,0,0,0,0,0,0,0,0,0,0,0,0]
["Formell/Eignung bestanden?","Eignung",{"$f":"Eignung!C19","v":"ja"},{"$f":"Eignung!D19","v":"ja"},{"$f":"Eignung!E19","v":"ja"},{"$f":"Eignung!F19","v":"ja"},{"$f":"Eignung!G19","v":"ja"},{"$f":"Eignung!H19","v":"ja"},{"$f":"Eignung!I19","v":"ja"},{"$f":"Eignung!J19","v":"ja"},{"$f":"Eignung!K19","v":"ja"},{"$f":"Eignung!L19","v":"ja"},{"$f":"Eignung!M19","v":"ja"},{"$f":"Eignung!N19","v":"ja"},{"$f":"Eignung!O19","v":"ja"},{"$f":"Eignung!P19","v":"ja"},{"$f":"Eignung!Q19","v":"ja"},{"$f":"Eignung!R19","v":"ja"},{"$f":"Eignung!S19","v":"ja"},{"$f":"Eignung!T19","v":"ja"},{"$f":"Eignung!U19","v":"ja"},{"$f":"Eignung!V19","v":"ja"}]
["Eingaben nach Formell/Eignung",null,{"$f":"IF(C5=Daten!$A$23,Auswertungstabelle!C4,\"\")","v":0},{"$f":"IF(D5=Daten!$A$23,Auswertungstabelle!D4,\"\")","v":0},{"$f":"IF(E5=Daten!$A$23,Auswertungstabelle!E4,\"\")","v":0},{"$f":"IF(F5=Daten!$A$23,Auswertungstabelle!F4,\"\")","v":0},{"$f":"IF(G5=Daten!$A$23,Auswertungstabelle!G4,\"\")","v":0},{"$f":"IF(H5=Daten!$A$23,Auswertungstabelle!H4,\"\")","v":0},{"$f":"IF(I5=Daten!$A$23,Auswertungstabelle!I4,\"\")","v":0},{"$f":"IF(J5=Daten!$A$23,Auswertungstabelle!J4,\"\")","v":0},{"$f":"IF(K5=Daten!$A$23,Auswertungstabelle!K4,\"\")","v":0},{"$f":"IF(L5=Daten!$A$23,Auswertungstabelle!L4,\"\")","v":0},{"$f":"IF(M5=Daten!$A$23,Auswertungstabelle!M4,\"\")","v":0},{"$f":"IF(N5=Daten!$A$23,Auswertungstabelle!N4,\"\")","v":0},{"$f":"IF(O5=Daten!$A$23,Auswertungstabelle!O4,\"\")","v":0},{"$f":"IF(P5=Daten!$A$23,Auswertungstabelle!P4,\"\")","v":0},{"$f":"IF(Q5=Daten!$A$23,Auswertungstabelle!Q4,\"\")","v":0},{"$f":"IF(R5=Daten!$A$23,Auswertungstabelle!R4,\"\")","v":0},{"$f":"IF(S5=Daten!$A$23,Auswertungstabelle!S4,\"\")","v":0},{"$f":"IF(T5=Daten!$A$23,Auswertungstabelle!T4,\"\")","v":0},{"$f":"IF(U5=Daten!$A$23,Auswertungstabelle!U4,\"\")","v":0},{"$f":"IF(V5=Daten!$A$23,Auswertungstabelle!V4,\"\")","v":0}]
[]
["Bereinigung der Kosten"]
["Rabatt gemäss Angebot","Offertöffnung",{"$f":"TRANSPOSE(Offertöffnung!J18:J37)","v":0},0,0,0,0,0,0,0,0,0,0,0,0,0,0,0,0,0,0,0]
["Skonto gemäss Angebot","Offertöffnung",{"$f":"TRANSPOSE(Offertöffnung!K18:K37)","v":0},0,0,0,0,0,0,0,0,0,0,0,0,0,0,0,0,0,0,0]
["nach Bereinigung der Kosten","Kosten",{"$f":"IF(C3=\"\",\"\",Kosten!D31)","v":""},{"$f":"IF(D3=\"\",\"\",Kosten!F31)","v":""},{"$f":"IF(E3=\"\",\"\",Kosten!H31)","v":""},{"$f":"IF(F3=\"\",\"\",Kosten!J31)","v":""},{"$f":"IF(G3=\"\",\"\",Kosten!L31)","v":""},{"$f":"IF(H3=\"\",\"\",Kosten!N31)","v":""},{"$f":"IF(I3=\"\",\"\",Kosten!P31)","v":""},{"$f":"IF(J3=\"\",\"\",Kosten!R31)","v":""},{"$f":"IF(K3=\"\",\"\",Kosten!T31)","v":""},{"$f":"IF(L3=\"\",\"\",Kosten!V31)","v":""},{"$f":"IF(M3=\"\",\"\",Kosten!X31)","v":""},{"$f":"IF(N3=\"\",\"\",Kosten!Z31)","v":""},{"$f":"IF(O3=\"\",\"\",Kosten!AB31)","v":""},{"$f":"IF(P3=\"\",\"\",Kosten!AD31)","v":""},{"$f":"IF(Q3=\"\",\"\",Kosten!AF31)","v":""},{"$f":"IF(R3=\"\",\"\",Kosten!AH31)","v":""},{"$f":"IF(S3=\"\",\"\",Kosten!AJ31)","v":""},{"$f":"IF(T3=\"\",\"\",Kosten!AL31)","v":""},{"$f":"IF(U3=\"\",\"\",Kosten!AN31)","v":""},{"$f":"IF(V3=\"\",\"\",Kosten!AP31)","v":""},null,{"$f":"MIN(C11:V11)","v":0},"Minimum"]
["(auf CHF 0.05 gerundet)"]
[]
[]
[]
["Punkteberechnung für den Preis"]
[]
["Preisspanne",{"$f":"Zuschlag!C20-100","v":50}]
[]
[null,"linear",{"$f":"IF(C11=\"\",\"\",((5-(((C11/$X$11*100)-100)/$B$18)*5)))","v":""},{"$f":"IF(D11=\"\",\"\",((5-(((D11/$X$11*100)-100)/$B$18)*5)))","v":""},"","","","","","","","","","","","","","","","","","","Wurde angepasst, nun OHNE Rundung auf 1 Stelle"]
[null,"linear, nur positive Werte",{"$f":"IF(C20<0,0,C20)","v":""},{"$f":"IF(D20<0,0,D20)","v":""},"","","","","","","","","","","","","","","","","",""]
[]
[null,"asymptotisch",{"$f":"IF(C11=\"\",\"\",($X$11^2*5)/(C11^2))","v":""},{"$f":"IF(D11=\"\",\"\",($X$11^2*5)/(D11^2))","v":""},"","","","","","","","","","","","","","","","","","","Wurde angepasst, nun OHNE Rundung auf 1 Stelle"]
[]
[]
[]
["Gesamtpunkte und Rang",null,{"$f":"C2","v":1},{"$f":"D2","v":2},3,4,5,6,7,8,9,10,11,12,13,14,15,16,17,18,19,20]
[null,null,{"$f":"C3","v":""},{"$f":"D3","v":""},"","","","","","","","","","","","","","","","","",""]
[null,null,{"$f":"IF(C5=Daten!$A24,Daten!$A28,\"\")","v":""},{"$f":"IF(D5=Daten!$A24,Daten!$A28,\"\")","v":""},{"$f":"IF(E5=Daten!$A24,Daten!$A28,\"\")","v":""},{"$f":"IF(F5=Daten!$A24,Daten!$A28,\"\")","v":""},{"$f":"IF(G5=Daten!$A24,Daten!$A28,\"\")","v":""},{"$f":"IF(H5=Daten!$A24,Daten!$A28,\"\")","v":""},{"$f":"IF(I5=Daten!$A24,Daten!$A28,\"\")","v":""},{"$f":"IF(J5=Daten!$A24,Daten!$A28,\"\")","v":""},{"$f":"IF(K5=Daten!$A24,Daten!$A28,\"\")","v":""},{"$f":"IF(L5=Daten!$A24,Daten!$A28,\"\")","v":""},{"$f":"IF(M5=Daten!$A24,Daten!$A28,\"\")","v":""},{"$f":"IF(N5=Daten!$A24,Daten!$A28,\"\")","v":""},{"$f":"IF(O5=Daten!$A24,Daten!$A28,\"\")","v":""},{"$f":"IF(P5=Daten!$A24,Daten!$A28,\"\")","v":""},{"$f":"IF(Q5=Daten!$A24,Daten!$A28,\"\")","v":""},{"$f":"IF(R5=Daten!$A24,Daten!$A28,\"\")","v":""},{"$f":"IF(S5=Daten!$A24,Daten!$A28,\"\")","v":""},{"$f":"IF(T5=Daten!$A24,Daten!$A28,\"\")","v":""},{"$f":"IF(U5=Daten!$A24,Daten!$A28,\"\")","v":""},{"$f":"IF(V5=Daten!$A24,Daten!$A28,\"\")","v":""}]
[null,null,{"$f":"Zuschlag!E63","v":""},{"$f":"Zuschlag!G63","v":""},{"$f":"Zuschlag!I63","v":""},{"$f":"Zuschlag!K63","v":""},{"$f":"Zuschlag!M63","v":""},{"$f":"Zuschlag!O63","v":""},{"$f":"Zuschlag!Q63","v":""},{"$f":"Zuschlag!S63","v":""},{"$f":"Zuschlag!U63","v":""},{"$f":"Zuschlag!W63","v":""},{"$f":"Zuschlag!Y63","v":""},{"$f":"Zuschlag!AA63","v":""},{"$f":"Zuschlag!AC63","v":""},{"$f":"Zuschlag!AE63","v":""},{"$f":"Zuschlag!AG63","v":""},{"$f":"Zuschlag!AI63","v":""},{"$f":"Zuschlag!AK63","v":""},{"$f":"Zuschlag!AM63","v":""},{"$f":"Zuschlag!AO63","v":""},{"$f":"Zuschlag!AQ63","v":""}]
[]
[null,"Rang",{"$f":"IF(C30=\"\",\"\",_xlfn.RANK.EQ(C30,$C$30:$V$30,0))","v":""},{"$f":"IF(D30=\"\",\"\",_xlfn.RANK.EQ(D30,$C$30:$V$30,0))","v":""},"","","","","","","","","","","","","","","","","",""]
[null,"Prozente auf Punkte",{"$f":"IF(C32=1,100%,IF(C32=\"\",\"\",(MAX($C$30:$V$30)-C30)/MAX($C$30:$V$30)+1))","v":""},{"$f":"IF(D32=1,100%,IF(D32=\"\",\"\",(MAX($C$30:$V$30)-D30)/MAX($C$30:$V$30)+1))","v":""},"","","","","","","","","","","","","","","","","",""]
[]
[null,"Keine Formfehler",{"$f":"IF(C28=\"\",\"\",Formell!C19)","v":""},{"$f":"IF(D28=\"\",\"\",Formell!D19)","v":""},{"$f":"IF(E28=\"\",\"\",Formell!E19)","v":""},{"$f":"IF(F28=\"\",\"\",Formell!F19)","v":""},{"$f":"IF(G28=\"\",\"\",Formell!G19)","v":""},{"$f":"IF(H28=\"\",\"\",Formell!H19)","v":""},{"$f":"IF(I28=\"\",\"\",Formell!I19)","v":""},{"$f":"IF(J28=\"\",\"\",Formell!J19)","v":""},{"$f":"IF(K28=\"\",\"\",Formell!K19)","v":""},{"$f":"IF(L28=\"\",\"\",Formell!L19)","v":""},{"$f":"IF(M28=\"\",\"\",Formell!M19)","v":""},{"$f":"IF(N28=\"\",\"\",Formell!N19)","v":""},{"$f":"IF(O28=\"\",\"\",Formell!O19)","v":""},{"$f":"IF(P28=\"\",\"\",Formell!P19)","v":""},{"$f":"IF(Q28=\"\",\"\",Formell!Q19)","v":""},{"$f":"IF(R28=\"\",\"\",Formell!R19)","v":""},{"$f":"IF(S28=\"\",\"\",Formell!S19)","v":""},{"$f":"IF(T28=\"\",\"\",Formell!T19)","v":""},{"$f":"IF(U28=\"\",\"\",Formell!U19)","v":""},{"$f":"IF(V28=\"\",\"\",Formell!V19)","v":""}]
[null,"Eignungskriterien",{"$f":"IF(OR(C28=\"\",C35=Daten!$A24),\"\",C5)","v":""},{"$f":"IF(OR(D28=\"\",D35=Daten!$A24),\"\",D5)","v":""},{"$f":"IF(OR(E28=\"\",E35=Daten!$A24),\"\",E5)","v":""},{"$f":"IF(OR(F28=\"\",F35=Daten!$A24),\"\",F5)","v":""},{"$f":"IF(OR(G28=\"\",G35=Daten!$A24),\"\",G5)","v":""},{"$f":"IF(OR(H28=\"\",H35=Daten!$A24),\"\",H5)","v":""},{"$f":"IF(OR(I28=\"\",I35=Daten!$A24),\"\",I5)","v":""},{"$f":"IF(OR(J28=\"\",J35=Daten!$A24),\"\",J5)","v":""},{"$f":"IF(OR(K28=\"\",K35=Daten!$A24),\"\",K5)","v":""},{"$f":"IF(OR(L28=\"\",L35=Daten!$A24),\"\",L5)","v":""},{"$f":"IF(OR(M28=\"\",M35=Daten!$A24),\"\",M5)","v":""},{"$f":"IF(OR(N28=\"\",N35=Daten!$A24),\"\",N5)","v":""},{"$f":"IF(OR(O28=\"\",O35=Daten!$A24),\"\",O5)","v":""},{"$f":"IF(OR(P28=\"\",P35=Daten!$A24),\"\",P5)","v":""},{"$f":"IF(OR(Q28=\"\",Q35=Daten!$A24),\"\",Q5)","v":""},{"$f":"IF(OR(R28=\"\",R35=Daten!$A24),\"\",R5)","v":""},{"$f":"IF(OR(S28=\"\",S35=Daten!$A24),\"\",S5)","v":""},{"$f":"IF(OR(T28=\"\",T35=Daten!$A24),\"\",T5)","v":""},{"$f":"IF(OR(U28=\"\",U35=Daten!$A24),\"\",U5)","v":""},{"$f":"IF(OR(V28=\"\",V35=Daten!$A24),\"\",V5)","v":""}]
[]
[]
[]
["Gesamt",null,{"$f":"C2","v":1},2,3,4,5,6,7,8,9,10,11,12,13,14,15,16,17,18,19,20]
[null,null,{"$f":"C3","v":""},"","","","","","","","","","","","","","","","","","",""]
[null,null,{"$f":"IF(C5=Daten!$A24,Daten!$A147,\"\")","v":""},{"$f":"IF(D5=Daten!$A24,Daten!$A147,\"\")","v":""},{"$f":"IF(E5=Daten!$A24,Daten!$A147,\"\")","v":""},{"$f":"IF(F5=Daten!$A24,Daten!$A147,\"\")","v":""},{"$f":"IF(G5=Daten!$A24,Daten!$A147,\"\")","v":""},{"$f":"IF(H5=Daten!$A24,Daten!$A147,\"\")","v":""},{"$f":"IF(I5=Daten!$A24,Daten!$A147,\"\")","v":""},{"$f":"IF(J5=Daten!$A24,Daten!$A147,\"\")","v":""},{"$f":"IF(K5=Daten!$A24,Daten!$A147,\"\")","v":""},{"$f":"IF(L5=Daten!$A24,Daten!$A147,\"\")","v":""},{"$f":"IF(M5=Daten!$A24,Daten!$A147,\"\")","v":""},{"$f":"IF(N5=Daten!$A24,Daten!$A147,\"\")","v":""},{"$f":"IF(O5=Daten!$A24,Daten!$A147,\"\")","v":""},{"$f":"IF(P5=Daten!$A24,Daten!$A147,\"\")","v":""},{"$f":"IF(Q5=Daten!$A24,Daten!$A147,\"\")","v":""},{"$f":"IF(R5=Daten!$A24,Daten!$A147,\"\")","v":""},{"$f":"IF(S5=Daten!$A24,Daten!$A147,\"\")","v":""},{"$f":"IF(T5=Daten!$A24,Daten!$A147,\"\")","v":""},{"$f":"IF(U5=Daten!$A24,Daten!$A147,\"\")","v":""},{"$f":"IF(V5=Daten!$A24,Daten!$A147,\"\")","v":""}]
[]
[null,null,{"$f":"C41&C42","v":""},{"$f":"D41&D42","v":""},"","","","","","","","","","","","","","","","","",""]
[]
[]
[]
["Auswertung Nummer 1 für Antrag",null,{"$f":"C2","v":1},2,3,4,5,6,7,8,9,10,11,12,13,14,15,16,17,18,19,20]
[null,null,{"$f":"C3","v":""},"","","","","","","","","","","","","","","","","","",""]
[null,"Rang",{"$f":"C32:V32","v":""},"","","","","","","","","","","","","","","","","","","",null,{"$f":"IF(COUNTIF(C50:V50,1)>1,\"Achtung\",\"OK\")","v":"OK"}]
[null,null,{"$f":"IF(C50=1,\"Sieg\")","v":false},{"$f":"IF(D50=1,\"Sieg\")","v":false},false,false,false,false,false,false,false,false,false,false,false,false,false,false,false,false,false,false]
[]
[null,"Name",{"$f":"TRANSPOSE(Offertöffnung!C18:C37)","v":0},0,0,0,0,0,0,0,0,0,0,0,0,0,0,0,0,0,0,0,null,{"$f":"IF(X50=\"Achtung\",Daten!A180,IFERROR(HLOOKUP(\"Sieg\",$C$51:$V$58,3),\"\"))","v":""}]
[null,"Strasse",{"$f":"TRANSPOSE(Offertöffnung!D18:D37)","v":0},0,0,0,0,0,0,0,0,0,0,0,0,0,0,0,0,0,0,0,null,{"$f":"IF(X50=\"Achtung\",Daten!A180,IFERROR(HLOOKUP(\"Sieg\",$C$51:$V$58,4),\"\"))","v":""}]
[null,"PLZ",{"$f":"TRANSPOSE(Offertöffnung!E18:E37)","v":0},0,0,0,0,0,0,0,0,0,0,0,0,0,0,0,0,0,0,0,null,{"$f":"IF(X50=\"Achtung\",Daten!A180,IFERROR(HLOOKUP(\"Sieg\",$C$51:$V$58,5)&\" \"&HLOOKUP(\"Sieg\",$C$51:$V$58,6),\"\"))","v":""}]
[null,"Ort",{"$f":"TRANSPOSE(Offertöffnung!F18:F37)","v":0},0,0,0,0,0,0,0,0,0,0,0,0,0,0,0,0,0,0,0]
[]
[null,"Kosten",{"$f":"C11","v":""},"","","","","","","","","","","","","","","","","","","ungerundet:",null,{"$f":"HLOOKUP(\"Sieg\",$C$51:$V$58,8)","v":{"$error":"#N/A"}}]
[]
[{"$nulls":21},"auf 5 Rappen gerundet:",null,{"$f":"IFERROR(ROUND(X58*20,0)/20,\"\")","v":""}]

{"sheet":"Aufbereitung Diagramm","index":12,"n_rows":48,"n_cols":43,"rows_kept":48,"cut":false,"hidden":true,"merged":[]}
[{"$nulls":4},{"$f":"Zuschlag!E12","v":""},{"$f":"Zuschlag!F12","v":0},{"$f":"Zuschlag!G12","v":""},{"$f":"Zuschlag!H12","v":0},{"$f":"Zuschlag!I12","v":""},{"$f":"Zuschlag!J12","v":0},{"$f":"Zuschlag!K12","v":""},{"$f":"Zuschlag!L12","v":0},{"$f":"Zuschlag!M12","v":""},{"$f":"Zuschlag!N12","v":0},{"$f":"Zuschlag!O12","v":""},{"$f":"Zuschlag!P12","v":0},{"$f":"Zuschlag!Q12","v":""},{"$f":"Zuschlag!R12","v":0},{"$f":"Zuschlag!S12","v":""},{"$f":"Zuschlag!T12","v":0},{"$f":"Zuschlag!U12","v":""},{"$f":"Zuschlag!V12","v":0},{"$f":"Zuschlag!W12","v":""},{"$f":"Zuschlag!X12","v":0},{"$f":"Zuschlag!Y12","v":""},{"$f":"Zuschlag!Z12","v":0},{"$f":"Zuschlag!AA12","v":""},{"$f":"Zuschlag!AB12","v":0},{"$f":"Zuschlag!AC12","v":""},{"$f":"Zuschlag!AD12","v":0},{"$f":"Zuschlag!AE12","v":""},{"$f":"Zuschlag!AF12","v":0},{"$f":"Zuschlag!AG12","v":""},{"$f":"Zuschlag!AH12","v":0},{"$f":"Zuschlag!AI12","v":""},{"$f":"Zuschlag!AJ12","v":0},{"$f":"Zuschlag!AK12","v":""},{"$f":"Zuschlag!AL12","v":0},{"$f":"Zuschlag!AM12","v":""},{"$f":"Zuschlag!AN12","v":0},{"$f":"Zuschlag!AO12","v":""},{"$f":"Zuschlag!AP12","v":0},{"$f":"Zuschlag!AQ12","v":""}]
[{"$nulls":4},{"$f":"Zuschlag!E13","v":""},{"$f":"Zuschlag!F13","v":0},{"$f":"Zuschlag!G13","v":""},{"$f":"Zuschlag!H13","v":0},{"$f":"Zuschlag!I13","v":""},{"$f":"Zuschlag!J13","v":0},{"$f":"Zuschlag!K13","v":""},{"$f":"Zuschlag!L13","v":0},{"$f":"Zuschlag!M13","v":""},{"$f":"Zuschlag!N13","v":0},{"$f":"Zuschlag!O13","v":""},{"$f":"Zuschlag!P13","v":0},{"$f":"Zuschlag!Q13","v":""},{"$f":"Zuschlag!R13","v":0},{"$f":"Zuschlag!S13","v":""},{"$f":"Zuschlag!T13","v":0},{"$f":"Zuschlag!U13","v":""},{"$f":"Zuschlag!V13","v":0},{"$f":"Zuschlag!W13","v":""},{"$f":"Zuschlag!X13","v":0},{"$f":"Zuschlag!Y13","v":""},{"$f":"Zuschlag!Z13","v":0},{"$f":"Zuschlag!AA13","v":""},{"$f":"Zuschlag!AB13","v":0},{"$f":"Zuschlag!AC13","v":""},{"$f":"Zuschlag!AD13","v":0},{"$f":"Zuschlag!AE13","v":""},{"$f":"Zuschlag!AF13","v":0},{"$f":"Zuschlag!AG13","v":""},{"$f":"Zuschlag!AH13","v":0},{"$f":"Zuschlag!AI13","v":""},{"$f":"Zuschlag!AJ13","v":0},{"$f":"Zuschlag!AK13","v":""},{"$f":"Zuschlag!AL13","v":0},{"$f":"Zuschlag!AM13","v":""},{"$f":"Zuschlag!AN13","v":0},{"$f":"Zuschlag!AO13","v":""},{"$f":"Zuschlag!AP13","v":0},{"$f":"Zuschlag!AQ13","v":""}]
[{"$nulls":4},{"$f":"IF(E2=\"\",\"\",\", \"&E2)","v":""},{"$f":"IF(F2=\"\",\"\",\", \"&F2)","v":", 0"},"",", 0","",", 0","",", 0","",", 0","",", 0","",", 0","",", 0","",", 0","",", 0","",", 0","",", 0","",", 0","",", 0","",", 0","",", 0","",", 0","",", 0","",", 0",""]
[null,null,null,{"$f":"Daten!A177","v":"Zuschlag, Diagramm"},{"$f":"E1&E3","v":""},{"$f":"F1&F3","v":"0, 0"},"","0, 0","","0, 0","","0, 0","","0, 0","","0, 0","","0, 0","","0, 0","","0, 0","","0, 0","","0, 0","","0, 0","","0, 0","","0, 0","","0, 0","","0, 0","","0, 0","","0, 0","","0, 0",""]
[1,"Preis",{"$f":"IF(B5=0,\"\",B5)","v":"Preis"},{"$f":"A5&\") \"&C5","v":"1) Preis"},{"$f":"IF(E$48=Daten!$A$146,\"\",IF(Zuschlag!F18=0,\"\",Zuschlag!F18))","v":""},{"$f":"IF(F$48=Daten!$A$146,\"\",IF(Zuschlag!G18=0,\"\",Zuschlag!G18))","v":""},{"$f":"IF(G$48=Daten!$A$146,\"\",IF(Zuschlag!H18=0,\"\",Zuschlag!H18))","v":""},{"$f":"IF(H$48=Daten!$A$146,\"\",IF(Zuschlag!I18=0,\"\",Zuschlag!I18))","v":""},{"$f":"IF(I$48=Daten!$A$146,\"\",IF(Zuschlag!J18=0,\"\",Zuschlag!J18))","v":""},{"$f":"IF(J$48=Daten!$A$146,\"\",IF(Zuschlag!K18=0,\"\",Zuschlag!K18))","v":""},{"$f":"IF(K$48=Daten!$A$146,\"\",IF(Zuschlag!L18=0,\"\",Zuschlag!L18))","v":""},{"$f":"IF(L$48=Daten!$A$146,\"\",IF(Zuschlag!M18=0,\"\",Zuschlag!M18))","v":""},{"$f":"IF(M$48=Daten!$A$146,\"\",IF(Zuschlag!N18=0,\"\",Zuschlag!N18))","v":""},{"$f":"IF(N$48=Daten!$A$146,\"\",IF(Zuschlag!O18=0,\"\",Zuschlag!O18))","v":""},{"$f":"IF(O$48=Daten!$A$146,\"\",IF(Zuschlag!P18=0,\"\",Zuschlag!P18))","v":""},{"$f":"IF(P$48=Daten!$A$146,\"\",IF(Zuschlag!Q18=0,\"\",Zuschlag!Q18))","v":""},{"$f":"IF(Q$48=Daten!$A$146,\"\",IF(Zuschlag!R18=0,\"\",Zuschlag!R18))","v":""},{"$f":"IF(R$48=Daten!$A$146,\"\",IF(Zuschlag!S18=0,\"\",Zuschlag!S18))","v":""},{"$f":"IF(S$48=Daten!$A$146,\"\",IF(Zuschlag!T18=0,\"\",Zuschlag!T18))","v":""},{"$f":"IF(T$48=Daten!$A$146,\"\",IF(Zuschlag!U18=0,\"\",Zuschlag!U18))","v":""},{"$f":"IF(U$48=Daten!$A$146,\"\",IF(Zuschlag!V18=0,\"\",Zuschlag!V18))","v":""},{"$f":"IF(V$48=Daten!$A$146,\"\",IF(Zuschlag!W18=0,\"\",Zuschlag!W18))","v":""},{"$f":"IF(W$48=Daten!$A$146,\"\",IF(Zuschlag!X18=0,\"\",Zuschlag!X18))","v":""},{"$f":"IF(X$48=Daten!$A$146,\"\",IF(Zuschlag!Y18=0,\"\",Zuschlag!Y18))","v":""},{"$f":"IF(Y$48=Daten!$A$146,\"\",IF(Zuschlag!Z18=0,\"\",Zuschlag!Z18))","v":""},{"$f":"IF(Z$48=Daten!$A$146,\"\",IF(Zuschlag!AA18=0,\"\",Zuschlag!AA18))","v":""},{"$f":"IF(AA$48=Daten!$A$146,\"\",IF(Zuschlag!AB18=0,\"\",Zuschlag!AB18))","v":""},{"$f":"IF(AB$48=Daten!$A$146,\"\",IF(Zuschlag!AC18=0,\"\",Zuschlag!AC18))","v":""},{"$f":"IF(AC$48=Daten!$A$146,\"\",IF(Zuschlag!AD18=0,\"\",Zuschlag!AD18))","v":""},{"$f":"IF(AD$48=Daten!$A$146,\"\",IF(Zuschlag!AE18=0,\"\",Zuschlag!AE18))","v":""},{"$f":"IF(AE$48=Daten!$A$146,\"\",IF(Zuschlag!AF18=0,\"\",Zuschlag!AF18))","v":""},{"$f":"IF(AF$48=Daten!$A$146,\"\",IF(Zuschlag!AG18=0,\"\",Zuschlag!AG18))","v":""},{"$f":"IF(AG$48=Daten!$A$146,\"\",IF(Zuschlag!AH18=0,\"\",Zuschlag!AH18))","v":""},{"$f":"IF(AH$48=Daten!$A$146,\"\",IF(Zuschlag!AI18=0,\"\",Zuschlag!AI18))","v":""},{"$f":"IF(AI$48=Daten!$A$146,\"\",IF(Zuschlag!AJ18=0,\"\",Zuschlag!AJ18))","v":""},{"$f":"IF(AJ$48=Daten!$A$146,\"\",IF(Zuschlag!AK18=0,\"\",Zuschlag!AK18))","v":""},{"$f":"IF(AK$48=Daten!$A$146,\"\",IF(Zuschlag!AL18=0,\"\",Zuschlag!AL18))","v":""},{"$f":"IF(AL$48=Daten!$A$146,\"\",IF(Zuschlag!AM18=0,\"\",Zuschlag!AM18))","v":""},{"$f":"IF(AM$48=Daten!$A$146,\"\",IF(Zuschlag!AN18=0,\"\",Zuschlag!AN18))","v":""},{"$f":"IF(AN$48=Daten!$A$146,\"\",IF(Zuschlag!AO18=0,\"\",Zuschlag!AO18))","v":""},{"$f":"IF(AO$48=Daten!$A$146,\"\",IF(Zuschlag!AP18=0,\"\",Zuschlag!AP18))","v":""},{"$f":"IF(AP$48=Daten!$A$146,\"\",IF(Zuschlag!AQ18=0,\"\",Zuschlag!AQ18))","v":""},{"$f":"IF(AQ$48=Daten!$A$146,\"\",IF(Zuschlag!AR18=0,\"\",Zuschlag!AR18))","v":""}]
[{"$f":"Zuschlag!A23","v":"2"},{"$f":"Zuschlag!B23","v":"Z2 Schlüsselpersonen"},{"$f":"IF(B6=0,\"\",B6)","v":"Z2 Schlüsselpersonen"},{"$f":"IF(B6=0,\"\",A6&\") \"&C6)","v":"2) Z2 Schlüsselpersonen"},{"$f":"IF(E$48=Daten!$A$146,\"\",IF(Zuschlag!F23=0,\"\",Zuschlag!F23))","v":""},{"$f":"IF(F$48=Daten!$A$146,\"\",IF(Zuschlag!G23=0,\"\",Zuschlag!G23))","v":""},{"$f":"IF(G$48=Daten!$A$146,\"\",IF(Zuschlag!H23=0,\"\",Zuschlag!H23))","v":""},{"$f":"IF(H$48=Daten!$A$146,\"\",IF(Zuschlag!I23=0,\"\",Zuschlag!I23))","v":""},{"$f":"IF(I$48=Daten!$A$146,\"\",IF(Zuschlag!J23=0,\"\",Zuschlag!J23))","v":""},{"$f":"IF(J$48=Daten!$A$146,\"\",IF(Zuschlag!K23=0,\"\",Zuschlag!K23))","v":""},{"$f":"IF(K$48=Daten!$A$146,\"\",IF(Zuschlag!L23=0,\"\",Zuschlag!L23))","v":""},{"$f":"IF(L$48=Daten!$A$146,\"\",IF(Zuschlag!M23=0,\"\",Zuschlag!M23))","v":""},{"$f":"IF(M$48=Daten!$A$146,\"\",IF(Zuschlag!N23=0,\"\",Zuschlag!N23))","v":""},{"$f":"IF(N$48=Daten!$A$146,\"\",IF(Zuschlag!O23=0,\"\",Zuschlag!O23))","v":""},{"$f":"IF(O$48=Daten!$A$146,\"\",IF(Zuschlag!P23=0,\"\",Zuschlag!P23))","v":""},{"$f":"IF(P$48=Daten!$A$146,\"\",IF(Zuschlag!Q23=0,\"\",Zuschlag!Q23))","v":""},{"$f":"IF(Q$48=Daten!$A$146,\"\",IF(Zuschlag!R23=0,\"\",Zuschlag!R23))","v":""},{"$f":"IF(R$48=Daten!$A$146,\"\",IF(Zuschlag!S23=0,\"\",Zuschlag!S23))","v":""},{"$f":"IF(S$48=Daten!$A$146,\"\",IF(Zuschlag!T23=0,\"\",Zuschlag!T23))","v":""},{"$f":"IF(T$48=Daten!$A$146,\"\",IF(Zuschlag!U23=0,\"\",Zuschlag!U23))","v":""},{"$f":"IF(U$48=Daten!$A$146,\"\",IF(Zuschlag!V23=0,\"\",Zuschlag!V23))","v":""},{"$f":"IF(V$48=Daten!$A$146,\"\",IF(Zuschlag!W23=0,\"\",Zuschlag!W23))","v":""},{"$f":"IF(W$48=Daten!$A$146,\"\",IF(Zuschlag!X23=0,\"\",Zuschlag!X23))","v":""},{"$f":"IF(X$48=Daten!$A$146,\"\",IF(Zuschlag!Y23=0,\"\",Zuschlag!Y23))","v":""},{"$f":"IF(Y$48=Daten!$A$146,\"\",IF(Zuschlag!Z23=0,\"\",Zuschlag!Z23))","v":""},{"$f":"IF(Z$48=Daten!$A$146,\"\",IF(Zuschlag!AA23=0,\"\",Zuschlag!AA23))","v":""},{"$f":"IF(AA$48=Daten!$A$146,\"\",IF(Zuschlag!AB23=0,\"\",Zuschlag!AB23))","v":""},{"$f":"IF(AB$48=Daten!$A$146,\"\",IF(Zuschlag!AC23=0,\"\",Zuschlag!AC23))","v":""},{"$f":"IF(AC$48=Daten!$A$146,\"\",IF(Zuschlag!AD23=0,\"\",Zuschlag!AD23))","v":""},{"$f":"IF(AD$48=Daten!$A$146,\"\",IF(Zuschlag!AE23=0,\"\",Zuschlag!AE23))","v":""},{"$f":"IF(AE$48=Daten!$A$146,\"\",IF(Zuschlag!AF23=0,\"\",Zuschlag!AF23))","v":""},{"$f":"IF(AF$48=Daten!$A$146,\"\",IF(Zuschlag!AG23=0,\"\",Zuschlag!AG23))","v":""},{"$f":"IF(AG$48=Daten!$A$146,\"\",IF(Zuschlag!AH23=0,\"\",Zuschlag!AH23))","v":""},{"$f":"IF(AH$48=Daten!$A$146,\"\",IF(Zuschlag!AI23=0,\"\",Zuschlag!AI23))","v":""},{"$f":"IF(AI$48=Daten!$A$146,\"\",IF(Zuschlag!AJ23=0,\"\",Zuschlag!AJ23))","v":""},{"$f":"IF(AJ$48=Daten!$A$146,\"\",IF(Zuschlag!AK23=0,\"\",Zuschlag!AK23))","v":""},{"$f":"IF(AK$48=Daten!$A$146,\"\",IF(Zuschlag!AL23=0,\"\",Zuschlag!AL23))","v":""},{"$f":"IF(AL$48=Daten!$A$146,\"\",IF(Zuschlag!AM23=0,\"\",Zuschlag!AM23))","v":""},{"$f":"IF(AM$48=Daten!$A$146,\"\",IF(Zuschlag!AN23=0,\"\",Zuschlag!AN23))","v":""},{"$f":"IF(AN$48=Daten!$A$146,\"\",IF(Zuschlag!AO23=0,\"\",Zuschlag!AO23))","v":""},{"$f":"IF(AO$48=Daten!$A$146,\"\",IF(Zuschlag!AP23=0,\"\",Zuschlag!AP23))","v":""},{"$f":"IF(AP$48=Daten!$A$146,\"\",IF(Zuschlag!AQ23=0,\"\",Zuschlag!AQ23))","v":""},{"$f":"IF(AQ$48=Daten!$A$146,\"\",IF(Zuschlag!AR23=0,\"\",Zuschlag!AR23))","v":""}]
[{"$f":"Zuschlag!A24","v":0},{"$f":"Zuschlag!B24","v":0},{"$f":"IF(B7=0,\"\",B7)","v":""},{"$f":"IF(B7=0,\"\",A7&\") \"&C7)","v":""},{"$f":"IF(E$48=Daten!$A$146,\"\",IF(Zuschlag!F24=0,\"\",Zuschlag!F24))","v":""},{"$f":"IF(F$48=Daten!$A$146,\"\",IF(Zuschlag!G24=0,\"\",Zuschlag!G24))","v":""},{"$f":"IF(G$48=Daten!$A$146,\"\",IF(Zuschlag!H24=0,\"\",Zuschlag!H24))","v":""},{"$f":"IF(H$48=Daten!$A$146,\"\",IF(Zuschlag!I24=0,\"\",Zuschlag!I24))","v":""},{"$f":"IF(I$48=Daten!$A$146,\"\",IF(Zuschlag!J24=0,\"\",Zuschlag!J24))","v":""},{"$f":"IF(J$48=Daten!$A$146,\"\",IF(Zuschlag!K24=0,\"\",Zuschlag!K24))","v":""},{"$f":"IF(K$48=Daten!$A$146,\"\",IF(Zuschlag!L24=0,\"\",Zuschlag!L24))","v":""},{"$f":"IF(L$48=Daten!$A$146,\"\",IF(Zuschlag!M24=0,\"\",Zuschlag!M24))","v":""},{"$f":"IF(M$48=Daten!$A$146,\"\",IF(Zuschlag!N24=0,\"\",Zuschlag!N24))","v":""},{"$f":"IF(N$48=Daten!$A$146,\"\",IF(Zuschlag!O24=0,\"\",Zuschlag!O24))","v":""},{"$f":"IF(O$48=Daten!$A$146,\"\",IF(Zuschlag!P24=0,\"\",Zuschlag!P24))","v":""},{"$f":"IF(P$48=Daten!$A$146,\"\",IF(Zuschlag!Q24=0,\"\",Zuschlag!Q24))","v":""},{"$f":"IF(Q$48=Daten!$A$146,\"\",IF(Zuschlag!R24=0,\"\",Zuschlag!R24))","v":""},{"$f":"IF(R$48=Daten!$A$146,\"\",IF(Zuschlag!S24=0,\"\",Zuschlag!S24))","v":""},{"$f":"IF(S$48=Daten!$A$146,\"\",IF(Zuschlag!T24=0,\"\",Zuschlag!T24))","v":""},{"$f":"IF(T$48=Daten!$A$146,\"\",IF(Zuschlag!U24=0,\"\",Zuschlag!U24))","v":""},{"$f":"IF(U$48=Daten!$A$146,\"\",IF(Zuschlag!V24=0,\"\",Zuschlag!V24))","v":""},{"$f":"IF(V$48=Daten!$A$146,\"\",IF(Zuschlag!W24=0,\"\",Zuschlag!W24))","v":""},{"$f":"IF(W$48=Daten!$A$146,\"\",IF(Zuschlag!X24=0,\"\",Zuschlag!X24))","v":""},{"$f":"IF(X$48=Daten!$A$146,\"\",IF(Zuschlag!Y24=0,\"\",Zuschlag!Y24))","v":""},{"$f":"IF(Y$48=Daten!$A$146,\"\",IF(Zuschlag!Z24=0,\"\",Zuschlag!Z24))","v":""},{"$f":"IF(Z$48=Daten!$A$146,\"\",IF(Zuschlag!AA24=0,\"\",Zuschlag!AA24))","v":""},{"$f":"IF(AA$48=Daten!$A$146,\"\",IF(Zuschlag!AB24=0,\"\",Zuschlag!AB24))","v":""},{"$f":"IF(AB$48=Daten!$A$146,\"\",IF(Zuschlag!AC24=0,\"\",Zuschlag!AC24))","v":""},{"$f":"IF(AC$48=Daten!$A$146,\"\",IF(Zuschlag!AD24=0,\"\",Zuschlag!AD24))","v":""},{"$f":"IF(AD$48=Daten!$A$146,\"\",IF(Zuschlag!AE24=0,\"\",Zuschlag!AE24))","v":""},{"$f":"IF(AE$48=Daten!$A$146,\"\",IF(Zuschlag!AF24=0,\"\",Zuschlag!AF24))","v":""},{"$f":"IF(AF$48=Daten!$A$146,\"\",IF(Zuschlag!AG24=0,\"\",Zuschlag!AG24))","v":""},{"$f":"IF(AG$48=Daten!$A$146,\"\",IF(Zuschlag!AH24=0,\"\",Zuschlag!AH24))","v":""},{"$f":"IF(AH$48=Daten!$A$146,\"\",IF(Zuschlag!AI24=0,\"\",Zuschlag!AI24))","v":""},{"$f":"IF(AI$48=Daten!$A$146,\"\",IF(Zuschlag!AJ24=0,\"\",Zuschlag!AJ24))","v":""},{"$f":"IF(AJ$48=Daten!$A$146,\"\",IF(Zuschlag!AK24=0,\"\",Zuschlag!AK24))","v":""},{"$f":"IF(AK$48=Daten!$A$146,\"\",IF(Zuschlag!AL24=0,\"\",Zuschlag!AL24))","v":""},{"$f":"IF(AL$48=Daten!$A$146,\"\",IF(Zuschlag!AM24=0,\"\",Zuschlag!AM24))","v":""},{"$f":"IF(AM$48=Daten!$A$146,\"\",IF(Zuschlag!AN24=0,\"\",Zuschlag!AN24))","v":""},{"$f":"IF(AN$48=Daten!$A$146,\"\",IF(Zuschlag!AO24=0,\"\",Zuschlag!AO24))","v":""},{"$f":"IF(AO$48=Daten!$A$146,\"\",IF(Zuschlag!AP24=0,\"\",Zuschlag!AP24))","v":""},{"$f":"IF(AP$48=Daten!$A$146,\"\",IF(Zuschlag!AQ24=0,\"\",Zuschlag!AQ24))","v":""},{"$f":"IF(AQ$48=Daten!$A$146,\"\",IF(Zuschlag!AR24=0,\"\",Zuschlag!AR24))","v":""}]
[{"$f":"Zuschlag!A25","v":"2.1"},{"$f":"Zuschlag!B25","v":"Referenzangaben 1"},"Referenzangaben 1","2.1) Referenzangaben 1",{"$f":"IF(E$48=Daten!$A$146,\"\",IF(Zuschlag!F25=0,\"\",Zuschlag!F25))","v":""},{"$f":"IF(F$48=Daten!$A$146,\"\",IF(Zuschlag!G25=0,\"\",Zuschlag!G25))","v":""},{"$f":"IF(G$48=Daten!$A$146,\"\",IF(Zuschlag!H25=0,\"\",Zuschlag!H25))","v":""},{"$f":"IF(H$48=Daten!$A$146,\"\",IF(Zuschlag!I25=0,\"\",Zuschlag!I25))","v":""},{"$f":"IF(I$48=Daten!$A$146,\"\",IF(Zuschlag!J25=0,\"\",Zuschlag!J25))","v":""},{"$f":"IF(J$48=Daten!$A$146,\"\",IF(Zuschlag!K25=0,\"\",Zuschlag!K25))","v":""},{"$f":"IF(K$48=Daten!$A$146,\"\",IF(Zuschlag!L25=0,\"\",Zuschlag!L25))","v":""},{"$f":"IF(L$48=Daten!$A$146,\"\",IF(Zuschlag!M25=0,\"\",Zuschlag!M25))","v":""},{"$f":"IF(M$48=Daten!$A$146,\"\",IF(Zuschlag!N25=0,\"\",Zuschlag!N25))","v":""},{"$f":"IF(N$48=Daten!$A$146,\"\",IF(Zuschlag!O25=0,\"\",Zuschlag!O25))","v":""},{"$f":"IF(O$48=Daten!$A$146,\"\",IF(Zuschlag!P25=0,\"\",Zuschlag!P25))","v":""},{"$f":"IF(P$48=Daten!$A$146,\"\",IF(Zuschlag!Q25=0,\"\",Zuschlag!Q25))","v":""},{"$f":"IF(Q$48=Daten!$A$146,\"\",IF(Zuschlag!R25=0,\"\",Zuschlag!R25))","v":""},{"$f":"IF(R$48=Daten!$A$146,\"\",IF(Zuschlag!S25=0,\"\",Zuschlag!S25))","v":""},{"$f":"IF(S$48=Daten!$A$146,\"\",IF(Zuschlag!T25=0,\"\",Zuschlag!T25))","v":""},{"$f":"IF(T$48=Daten!$A$146,\"\",IF(Zuschlag!U25=0,\"\",Zuschlag!U25))","v":""},{"$f":"IF(U$48=Daten!$A$146,\"\",IF(Zuschlag!V25=0,\"\",Zuschlag!V25))","v":""},{"$f":"IF(V$48=Daten!$A$146,\"\",IF(Zuschlag!W25=0,\"\",Zuschlag!W25))","v":""},{"$f":"IF(W$48=Daten!$A$146,\"\",IF(Zuschlag!X25=0,\"\",Zuschlag!X25))","v":""},{"$f":"IF(X$48=Daten!$A$146,\"\",IF(Zuschlag!Y25=0,\"\",Zuschlag!Y25))","v":""},{"$f":"IF(Y$48=Daten!$A$146,\"\",IF(Zuschlag!Z25=0,\"\",Zuschlag!Z25))","v":""},{"$f":"IF(Z$48=Daten!$A$146,\"\",IF(Zuschlag!AA25=0,\"\",Zuschlag!AA25))","v":""},{"$f":"IF(AA$48=Daten!$A$146,\"\",IF(Zuschlag!AB25=0,\"\",Zuschlag!AB25))","v":""},{"$f":"IF(AB$48=Daten!$A$146,\"\",IF(Zuschlag!AC25=0,\"\",Zuschlag!AC25))","v":""},{"$f":"IF(AC$48=Daten!$A$146,\"\",IF(Zuschlag!AD25=0,\"\",Zuschlag!AD25))","v":""},{"$f":"IF(AD$48=Daten!$A$146,\"\",IF(Zuschlag!AE25=0,\"\",Zuschlag!AE25))","v":""},{"$f":"IF(AE$48=Daten!$A$146,\"\",IF(Zuschlag!AF25=0,\"\",Zuschlag!AF25))","v":""},{"$f":"IF(AF$48=Daten!$A$146,\"\",IF(Zuschlag!AG25=0,\"\",Zuschlag!AG25))","v":""},{"$f":"IF(AG$48=Daten!$A$146,\"\",IF(Zuschlag!AH25=0,\"\",Zuschlag!AH25))","v":""},{"$f":"IF(AH$48=Daten!$A$146,\"\",IF(Zuschlag!AI25=0,\"\",Zuschlag!AI25))","v":""},{"$f":"IF(AI$48=Daten!$A$146,\"\",IF(Zuschlag!AJ25=0,\"\",Zuschlag!AJ25))","v":""},{"$f":"IF(AJ$48=Daten!$A$146,\"\",IF(Zuschlag!AK25=0,\"\",Zuschlag!AK25))","v":""},{"$f":"IF(AK$48=Daten!$A$146,\"\",IF(Zuschlag!AL25=0,\"\",Zuschlag!AL25))","v":""},{"$f":"IF(AL$48=Daten!$A$146,\"\",IF(Zuschlag!AM25=0,\"\",Zuschlag!AM25))","v":""},{"$f":"IF(AM$48=Daten!$A$146,\"\",IF(Zuschlag!AN25=0,\"\",Zuschlag!AN25))","v":""},{"$f":"IF(AN$48=Daten!$A$146,\"\",IF(Zuschlag!AO25=0,\"\",Zuschlag!AO25))","v":""},{"$f":"IF(AO$48=Daten!$A$146,\"\",IF(Zuschlag!AP25=0,\"\",Zuschlag!AP25))","v":""},{"$f":"IF(AP$48=Daten!$A$146,\"\",IF(Zuschlag!AQ25=0,\"\",Zuschlag!AQ25))","v":""},{"$f":"IF(AQ$48=Daten!$A$146,\"\",IF(Zuschlag!AR25=0,\"\",Zuschlag!AR25))","v":""}]
[{"$f":"Zuschlag!A26","v":"2.2"},{"$f":"Zuschlag!B26","v":"Referenzangaben 2"},"Referenzangaben 2","2.2) Referenzangaben 2",{"$f":"IF(E$48=Daten!$A$146,\"\",IF(Zuschlag!F26=0,\"\",Zuschlag!F26))","v":""},{"$f":"IF(F$48=Daten!$A$146,\"\",IF(Zuschlag!G26=0,\"\",Zuschlag!G26))","v":""},{"$f":"IF(G$48=Daten!$A$146,\"\",IF(Zuschlag!H26=0,\"\",Zuschlag!H26))","v":""},{"$f":"IF(H$48=Daten!$A$146,\"\",IF(Zuschlag!I26=0,\"\",Zuschlag!I26))","v":""},{"$f":"IF(I$48=Daten!$A$146,\"\",IF(Zuschlag!J26=0,\"\",Zuschlag!J26))","v":""},{"$f":"IF(J$48=Daten!$A$146,\"\",IF(Zuschlag!K26=0,\"\",Zuschlag!K26))","v":""},{"$f":"IF(K$48=Daten!$A$146,\"\",IF(Zuschlag!L26=0,\"\",Zuschlag!L26))","v":""},{"$f":"IF(L$48=Daten!$A$146,\"\",IF(Zuschlag!M26=0,\"\",Zuschlag!M26))","v":""},{"$f":"IF(M$48=Daten!$A$146,\"\",IF(Zuschlag!N26=0,\"\",Zuschlag!N26))","v":""},{"$f":"IF(N$48=Daten!$A$146,\"\",IF(Zuschlag!O26=0,\"\",Zuschlag!O26))","v":""},{"$f":"IF(O$48=Daten!$A$146,\"\",IF(Zuschlag!P26=0,\"\",Zuschlag!P26))","v":""},{"$f":"IF(P$48=Daten!$A$146,\"\",IF(Zuschlag!Q26=0,\"\",Zuschlag!Q26))","v":""},{"$f":"IF(Q$48=Daten!$A$146,\"\",IF(Zuschlag!R26=0,\"\",Zuschlag!R26))","v":""},{"$f":"IF(R$48=Daten!$A$146,\"\",IF(Zuschlag!S26=0,\"\",Zuschlag!S26))","v":""},{"$f":"IF(S$48=Daten!$A$146,\"\",IF(Zuschlag!T26=0,\"\",Zuschlag!T26))","v":""},{"$f":"IF(T$48=Daten!$A$146,\"\",IF(Zuschlag!U26=0,\"\",Zuschlag!U26))","v":""},{"$f":"IF(U$48=Daten!$A$146,\"\",IF(Zuschlag!V26=0,\"\",Zuschlag!V26))","v":""},{"$f":"IF(V$48=Daten!$A$146,\"\",IF(Zuschlag!W26=0,\"\",Zuschlag!W26))","v":""},{"$f":"IF(W$48=Daten!$A$146,\"\",IF(Zuschlag!X26=0,\"\",Zuschlag!X26))","v":""},{"$f":"IF(X$48=Daten!$A$146,\"\",IF(Zuschlag!Y26=0,\"\",Zuschlag!Y26))","v":""},{"$f":"IF(Y$48=Daten!$A$146,\"\",IF(Zuschlag!Z26=0,\"\",Zuschlag!Z26))","v":""},{"$f":"IF(Z$48=Daten!$A$146,\"\",IF(Zuschlag!AA26=0,\"\",Zuschlag!AA26))","v":""},{"$f":"IF(AA$48=Daten!$A$146,\"\",IF(Zuschlag!AB26=0,\"\",Zuschlag!AB26))","v":""},{"$f":"IF(AB$48=Daten!$A$146,\"\",IF(Zuschlag!AC26=0,\"\",Zuschlag!AC26))","v":""},{"$f":"IF(AC$48=Daten!$A$146,\"\",IF(Zuschlag!AD26=0,\"\",Zuschlag!AD26))","v":""},{"$f":"IF(AD$48=Daten!$A$146,\"\",IF(Zuschlag!AE26=0,\"\",Zuschlag!AE26))","v":""},{"$f":"IF(AE$48=Daten!$A$146,\"\",IF(Zuschlag!AF26=0,\"\",Zuschlag!AF26))","v":""},{"$f":"IF(AF$48=Daten!$A$146,\"\",IF(Zuschlag!AG26=0,\"\",Zuschlag!AG26))","v":""},{"$f":"IF(AG$48=Daten!$A$146,\"\",IF(Zuschlag!AH26=0,\"\",Zuschlag!AH26))","v":""},{"$f":"IF(AH$48=Daten!$A$146,\"\",IF(Zuschlag!AI26=0,\"\",Zuschlag!AI26))","v":""},{"$f":"IF(AI$48=Daten!$A$146,\"\",IF(Zuschlag!AJ26=0,\"\",Zuschlag!AJ26))","v":""},{"$f":"IF(AJ$48=Daten!$A$146,\"\",IF(Zuschlag!AK26=0,\"\",Zuschlag!AK26))","v":""},{"$f":"IF(AK$48=Daten!$A$146,\"\",IF(Zuschlag!AL26=0,\"\",Zuschlag!AL26))","v":""},{"$f":"IF(AL$48=Daten!$A$146,\"\",IF(Zuschlag!AM26=0,\"\",Zuschlag!AM26))","v":""},{"$f":"IF(AM$48=Daten!$A$146,\"\",IF(Zuschlag!AN26=0,\"\",Zuschlag!AN26))","v":""},{"$f":"IF(AN$48=Daten!$A$146,\"\",IF(Zuschlag!AO26=0,\"\",Zuschlag!AO26))","v":""},{"$f":"IF(AO$48=Daten!$A$146,\"\",IF(Zuschlag!AP26=0,\"\",Zuschlag!AP26))","v":""},{"$f":"IF(AP$48=Daten!$A$146,\"\",IF(Zuschlag!AQ26=0,\"\",Zuschlag!AQ26))","v":""},{"$f":"IF(AQ$48=Daten!$A$146,\"\",IF(Zuschlag!AR26=0,\"\",Zuschlag!AR26))","v":""}]
[{"$f":"Zuschlag!A27","v":"2.3"},{"$f":"Zuschlag!B27","v":0},"","",{"$f":"IF(E$48=Daten!$A$146,\"\",IF(Zuschlag!F27=0,\"\",Zuschlag!F27))","v":""},{"$f":"IF(F$48=Daten!$A$146,\"\",IF(Zuschlag!G27=0,\"\",Zuschlag!G27))","v":""},{"$f":"IF(G$48=Daten!$A$146,\"\",IF(Zuschlag!H27=0,\"\",Zuschlag!H27))","v":""},{"$f":"IF(H$48=Daten!$A$146,\"\",IF(Zuschlag!I27=0,\"\",Zuschlag!I27))","v":""},{"$f":"IF(I$48=Daten!$A$146,\"\",IF(Zuschlag!J27=0,\"\",Zuschlag!J27))","v":""},{"$f":"IF(J$48=Daten!$A$146,\"\",IF(Zuschlag!K27=0,\"\",Zuschlag!K27))","v":""},{"$f":"IF(K$48=Daten!$A$146,\"\",IF(Zuschlag!L27=0,\"\",Zuschlag!L27))","v":""},{"$f":"IF(L$48=Daten!$A$146,\"\",IF(Zuschlag!M27=0,\"\",Zuschlag!M27))","v":""},{"$f":"IF(M$48=Daten!$A$146,\"\",IF(Zuschlag!N27=0,\"\",Zuschlag!N27))","v":""},{"$f":"IF(N$48=Daten!$A$146,\"\",IF(Zuschlag!O27=0,\"\",Zuschlag!O27))","v":""},{"$f":"IF(O$48=Daten!$A$146,\"\",IF(Zuschlag!P27=0,\"\",Zuschlag!P27))","v":""},{"$f":"IF(P$48=Daten!$A$146,\"\",IF(Zuschlag!Q27=0,\"\",Zuschlag!Q27))","v":""},{"$f":"IF(Q$48=Daten!$A$146,\"\",IF(Zuschlag!R27=0,\"\",Zuschlag!R27))","v":""},{"$f":"IF(R$48=Daten!$A$146,\"\",IF(Zuschlag!S27=0,\"\",Zuschlag!S27))","v":""},{"$f":"IF(S$48=Daten!$A$146,\"\",IF(Zuschlag!T27=0,\"\",Zuschlag!T27))","v":""},{"$f":"IF(T$48=Daten!$A$146,\"\",IF(Zuschlag!U27=0,\"\",Zuschlag!U27))","v":""},{"$f":"IF(U$48=Daten!$A$146,\"\",IF(Zuschlag!V27=0,\"\",Zuschlag!V27))","v":""},{"$f":"IF(V$48=Daten!$A$146,\"\",IF(Zuschlag!W27=0,\"\",Zuschlag!W27))","v":""},{"$f":"IF(W$48=Daten!$A$146,\"\",IF(Zuschlag!X27=0,\"\",Zuschlag!X27))","v":""},{"$f":"IF(X$48=Daten!$A$146,\"\",IF(Zuschlag!Y27=0,\"\",Zuschlag!Y27))","v":""},{"$f":"IF(Y$48=Daten!$A$146,\"\",IF(Zuschlag!Z27=0,\"\",Zuschlag!Z27))","v":""},{"$f":"IF(Z$48=Daten!$A$146,\"\",IF(Zuschlag!AA27=0,\"\",Zuschlag!AA27))","v":""},{"$f":"IF(AA$48=Daten!$A$146,\"\",IF(Zuschlag!AB27=0,\"\",Zuschlag!AB27))","v":""},{"$f":"IF(AB$48=Daten!$A$146,\"\",IF(Zuschlag!AC27=0,\"\",Zuschlag!AC27))","v":""},{"$f":"IF(AC$48=Daten!$A$146,\"\",IF(Zuschlag!AD27=0,\"\",Zuschlag!AD27))","v":""},{"$f":"IF(AD$48=Daten!$A$146,\"\",IF(Zuschlag!AE27=0,\"\",Zuschlag!AE27))","v":""},{"$f":"IF(AE$48=Daten!$A$146,\"\",IF(Zuschlag!AF27=0,\"\",Zuschlag!AF27))","v":""},{"$f":"IF(AF$48=Daten!$A$146,\"\",IF(Zuschlag!AG27=0,\"\",Zuschlag!AG27))","v":""},{"$f":"IF(AG$48=Daten!$A$146,\"\",IF(Zuschlag!AH27=0,\"\",Zuschlag!AH27))","v":""},{"$f":"IF(AH$48=Daten!$A$146,\"\",IF(Zuschlag!AI27=0,\"\",Zuschlag!AI27))","v":""},{"$f":"IF(AI$48=Daten!$A$146,\"\",IF(Zuschlag!AJ27=0,\"\",Zuschlag!AJ27))","v":""},{"$f":"IF(AJ$48=Daten!$A$146,\"\",IF(Zuschlag!AK27=0,\"\",Zuschlag!AK27))","v":""},{"$f":"IF(AK$48=Daten!$A$146,\"\",IF(Zuschlag!AL27=0,\"\",Zuschlag!AL27))","v":""},{"$f":"IF(AL$48=Daten!$A$146,\"\",IF(Zuschlag!AM27=0,\"\",Zuschlag!AM27))","v":""},{"$f":"IF(AM$48=Daten!$A$146,\"\",IF(Zuschlag!AN27=0,\"\",Zuschlag!AN27))","v":""},{"$f":"IF(AN$48=Daten!$A$146,\"\",IF(Zuschlag!AO27=0,\"\",Zuschlag!AO27))","v":""},{"$f":"IF(AO$48=Daten!$A$146,\"\",IF(Zuschlag!AP27=0,\"\",Zuschlag!AP27))","v":""},{"$f":"IF(AP$48=Daten!$A$146,\"\",IF(Zuschlag!AQ27=0,\"\",Zuschlag!AQ27))","v":""},{"$f":"IF(AQ$48=Daten!$A$146,\"\",IF(Zuschlag!AR27=0,\"\",Zuschlag!AR27))","v":""}]
[{"$f":"Zuschlag!A28","v":"2.4"},{"$f":"Zuschlag!B28","v":0},"","",{"$f":"IF(E$48=Daten!$A$146,\"\",IF(Zuschlag!F28=0,\"\",Zuschlag!F28))","v":""},{"$f":"IF(F$48=Daten!$A$146,\"\",IF(Zuschlag!G28=0,\"\",Zuschlag!G28))","v":""},{"$f":"IF(G$48=Daten!$A$146,\"\",IF(Zuschlag!H28=0,\"\",Zuschlag!H28))","v":""},{"$f":"IF(H$48=Daten!$A$146,\"\",IF(Zuschlag!I28=0,\"\",Zuschlag!I28))","v":""},{"$f":"IF(I$48=Daten!$A$146,\"\",IF(Zuschlag!J28=0,\"\",Zuschlag!J28))","v":""},{"$f":"IF(J$48=Daten!$A$146,\"\",IF(Zuschlag!K28=0,\"\",Zuschlag!K28))","v":""},{"$f":"IF(K$48=Daten!$A$146,\"\",IF(Zuschlag!L28=0,\"\",Zuschlag!L28))","v":""},{"$f":"IF(L$48=Daten!$A$146,\"\",IF(Zuschlag!M28=0,\"\",Zuschlag!M28))","v":""},{"$f":"IF(M$48=Daten!$A$146,\"\",IF(Zuschlag!N28=0,\"\",Zuschlag!N28))","v":""},{"$f":"IF(N$48=Daten!$A$146,\"\",IF(Zuschlag!O28=0,\"\",Zuschlag!O28))","v":""},{"$f":"IF(O$48=Daten!$A$146,\"\",IF(Zuschlag!P28=0,\"\",Zuschlag!P28))","v":""},{"$f":"IF(P$48=Daten!$A$146,\"\",IF(Zuschlag!Q28=0,\"\",Zuschlag!Q28))","v":""},{"$f":"IF(Q$48=Daten!$A$146,\"\",IF(Zuschlag!R28=0,\"\",Zuschlag!R28))","v":""},{"$f":"IF(R$48=Daten!$A$146,\"\",IF(Zuschlag!S28=0,\"\",Zuschlag!S28))","v":""},{"$f":"IF(S$48=Daten!$A$146,\"\",IF(Zuschlag!T28=0,\"\",Zuschlag!T28))","v":""},{"$f":"IF(T$48=Daten!$A$146,\"\",IF(Zuschlag!U28=0,\"\",Zuschlag!U28))","v":""},{"$f":"IF(U$48=Daten!$A$146,\"\",IF(Zuschlag!V28=0,\"\",Zuschlag!V28))","v":""},{"$f":"IF(V$48=Daten!$A$146,\"\",IF(Zuschlag!W28=0,\"\",Zuschlag!W28))","v":""},{"$f":"IF(W$48=Daten!$A$146,\"\",IF(Zuschlag!X28=0,\"\",Zuschlag!X28))","v":""},{"$f":"IF(X$48=Daten!$A$146,\"\",IF(Zuschlag!Y28=0,\"\",Zuschlag!Y28))","v":""},{"$f":"IF(Y$48=Daten!$A$146,\"\",IF(Zuschlag!Z28=0,\"\",Zuschlag!Z28))","v":""},{"$f":"IF(Z$48=Daten!$A$146,\"\",IF(Zuschlag!AA28=0,\"\",Zuschlag!AA28))","v":""},{"$f":"IF(AA$48=Daten!$A$146,\"\",IF(Zuschlag!AB28=0,\"\",Zuschlag!AB28))","v":""},{"$f":"IF(AB$48=Daten!$A$146,\"\",IF(Zuschlag!AC28=0,\"\",Zuschlag!AC28))","v":""},{"$f":"IF(AC$48=Daten!$A$146,\"\",IF(Zuschlag!AD28=0,\"\",Zuschlag!AD28))","v":""},{"$f":"IF(AD$48=Daten!$A$146,\"\",IF(Zuschlag!AE28=0,\"\",Zuschlag!AE28))","v":""},{"$f":"IF(AE$48=Daten!$A$146,\"\",IF(Zuschlag!AF28=0,\"\",Zuschlag!AF28))","v":""},{"$f":"IF(AF$48=Daten!$A$146,\"\",IF(Zuschlag!AG28=0,\"\",Zuschlag!AG28))","v":""},{"$f":"IF(AG$48=Daten!$A$146,\"\",IF(Zuschlag!AH28=0,\"\",Zuschlag!AH28))","v":""},{"$f":"IF(AH$48=Daten!$A$146,\"\",IF(Zuschlag!AI28=0,\"\",Zuschlag!AI28))","v":""},{"$f":"IF(AI$48=Daten!$A$146,\"\",IF(Zuschlag!AJ28=0,\"\",Zuschlag!AJ28))","v":""},{"$f":"IF(AJ$48=Daten!$A$146,\"\",IF(Zuschlag!AK28=0,\"\",Zuschlag!AK28))","v":""},{"$f":"IF(AK$48=Daten!$A$146,\"\",IF(Zuschlag!AL28=0,\"\",Zuschlag!AL28))","v":""},{"$f":"IF(AL$48=Daten!$A$146,\"\",IF(Zuschlag!AM28=0,\"\",Zuschlag!AM28))","v":""},{"$f":"IF(AM$48=Daten!$A$146,\"\",IF(Zuschlag!AN28=0,\"\",Zuschlag!AN28))","v":""},{"$f":"IF(AN$48=Daten!$A$146,\"\",IF(Zuschlag!AO28=0,\"\",Zuschlag!AO28))","v":""},{"$f":"IF(AO$48=Daten!$A$146,\"\",IF(Zuschlag!AP28=0,\"\",Zuschlag!AP28))","v":""},{"$f":"IF(AP$48=Daten!$A$146,\"\",IF(Zuschlag!AQ28=0,\"\",Zuschlag!AQ28))","v":""},{"$f":"IF(AQ$48=Daten!$A$146,\"\",IF(Zuschlag!AR28=0,\"\",Zuschlag!AR28))","v":""}]
[{"$f":"Zuschlag!A29","v":0},{"$f":"Zuschlag!B29","v":0},"","",{"$f":"IF(E$48=Daten!$A$146,\"\",IF(Zuschlag!F29=0,\"\",Zuschlag!F29))","v":""},{"$f":"IF(F$48=Daten!$A$146,\"\",IF(Zuschlag!G29=0,\"\",Zuschlag!G29))","v":""},{"$f":"IF(G$48=Daten!$A$146,\"\",IF(Zuschlag!H29=0,\"\",Zuschlag!H29))","v":""},{"$f":"IF(H$48=Daten!$A$146,\"\",IF(Zuschlag!I29=0,\"\",Zuschlag!I29))","v":""},{"$f":"IF(I$48=Daten!$A$146,\"\",IF(Zuschlag!J29=0,\"\",Zuschlag!J29))","v":""},{"$f":"IF(J$48=Daten!$A$146,\"\",IF(Zuschlag!K29=0,\"\",Zuschlag!K29))","v":""},{"$f":"IF(K$48=Daten!$A$146,\"\",IF(Zuschlag!L29=0,\"\",Zuschlag!L29))","v":""},{"$f":"IF(L$48=Daten!$A$146,\"\",IF(Zuschlag!M29=0,\"\",Zuschlag!M29))","v":""},{"$f":"IF(M$48=Daten!$A$146,\"\",IF(Zuschlag!N29=0,\"\",Zuschlag!N29))","v":""},{"$f":"IF(N$48=Daten!$A$146,\"\",IF(Zuschlag!O29=0,\"\",Zuschlag!O29))","v":""},{"$f":"IF(O$48=Daten!$A$146,\"\",IF(Zuschlag!P29=0,\"\",Zuschlag!P29))","v":""},{"$f":"IF(P$48=Daten!$A$146,\"\",IF(Zuschlag!Q29=0,\"\",Zuschlag!Q29))","v":""},{"$f":"IF(Q$48=Daten!$A$146,\"\",IF(Zuschlag!R29=0,\"\",Zuschlag!R29))","v":""},{"$f":"IF(R$48=Daten!$A$146,\"\",IF(Zuschlag!S29=0,\"\",Zuschlag!S29))","v":""},{"$f":"IF(S$48=Daten!$A$146,\"\",IF(Zuschlag!T29=0,\"\",Zuschlag!T29))","v":""},{"$f":"IF(T$48=Daten!$A$146,\"\",IF(Zuschlag!U29=0,\"\",Zuschlag!U29))","v":""},{"$f":"IF(U$48=Daten!$A$146,\"\",IF(Zuschlag!V29=0,\"\",Zuschlag!V29))","v":""},{"$f":"IF(V$48=Daten!$A$146,\"\",IF(Zuschlag!W29=0,\"\",Zuschlag!W29))","v":""},{"$f":"IF(W$48=Daten!$A$146,\"\",IF(Zuschlag!X29=0,\"\",Zuschlag!X29))","v":""},{"$f":"IF(X$48=Daten!$A$146,\"\",IF(Zuschlag!Y29=0,\"\",Zuschlag!Y29))","v":""},{"$f":"IF(Y$48=Daten!$A$146,\"\",IF(Zuschlag!Z29=0,\"\",Zuschlag!Z29))","v":""},{"$f":"IF(Z$48=Daten!$A$146,\"\",IF(Zuschlag!AA29=0,\"\",Zuschlag!AA29))","v":""},{"$f":"IF(AA$48=Daten!$A$146,\"\",IF(Zuschlag!AB29=0,\"\",Zuschlag!AB29))","v":""},{"$f":"IF(AB$48=Daten!$A$146,\"\",IF(Zuschlag!AC29=0,\"\",Zuschlag!AC29))","v":""},{"$f":"IF(AC$48=Daten!$A$146,\"\",IF(Zuschlag!AD29=0,\"\",Zuschlag!AD29))","v":""},{"$f":"IF(AD$48=Daten!$A$146,\"\",IF(Zuschlag!AE29=0,\"\",Zuschlag!AE29))","v":""},{"$f":"IF(AE$48=Daten!$A$146,\"\",IF(Zuschlag!AF29=0,\"\",Zuschlag!AF29))","v":""},{"$f":"IF(AF$48=Daten!$A$146,\"\",IF(Zuschlag!AG29=0,\"\",Zuschlag!AG29))","v":""},{"$f":"IF(AG$48=Daten!$A$146,\"\",IF(Zuschlag!AH29=0,\"\",Zuschlag!AH29))","v":""},{"$f":"IF(AH$48=Daten!$A$146,\"\",IF(Zuschlag!AI29=0,\"\",Zuschlag!AI29))","v":""},{"$f":"IF(AI$48=Daten!$A$146,\"\",IF(Zuschlag!AJ29=0,\"\",Zuschlag!AJ29))","v":""},{"$f":"IF(AJ$48=Daten!$A$146,\"\",IF(Zuschlag!AK29=0,\"\",Zuschlag!AK29))","v":""},{"$f":"IF(AK$48=Daten!$A$146,\"\",IF(Zuschlag!AL29=0,\"\",Zuschlag!AL29))","v":""},{"$f":"IF(AL$48=Daten!$A$146,\"\",IF(Zuschlag!AM29=0,\"\",Zuschlag!AM29))","v":""},{"$f":"IF(AM$48=Daten!$A$146,\"\",IF(Zuschlag!AN29=0,\"\",Zuschlag!AN29))","v":""},{"$f":"IF(AN$48=Daten!$A$146,\"\",IF(Zuschlag!AO29=0,\"\",Zuschlag!AO29))","v":""},{"$f":"IF(AO$48=Daten!$A$146,\"\",IF(Zuschlag!AP29=0,\"\",Zuschlag!AP29))","v":""},{"$f":"IF(AP$48=Daten!$A$146,\"\",IF(Zuschlag!AQ29=0,\"\",Zuschlag!AQ29))","v":""},{"$f":"IF(AQ$48=Daten!$A$146,\"\",IF(Zuschlag!AR29=0,\"\",Zuschlag!AR29))","v":""}]
[{"$f":"Zuschlag!A30","v":"3"},{"$f":"Zuschlag!B30","v":"Z3 Technischer Bericht "},"Z3 Technischer Bericht ","3) Z3 Technischer Bericht ",{"$f":"IF(E$48=Daten!$A$146,\"\",IF(Zuschlag!F30=0,\"\",Zuschlag!F30))","v":""},{"$f":"IF(F$48=Daten!$A$146,\"\",IF(Zuschlag!G30=0,\"\",Zuschlag!G30))","v":""},{"$f":"IF(G$48=Daten!$A$146,\"\",IF(Zuschlag!H30=0,\"\",Zuschlag!H30))","v":""},{"$f":"IF(H$48=Daten!$A$146,\"\",IF(Zuschlag!I30=0,\"\",Zuschlag!I30))","v":""},{"$f":"IF(I$48=Daten!$A$146,\"\",IF(Zuschlag!J30=0,\"\",Zuschlag!J30))","v":""},{"$f":"IF(J$48=Daten!$A$146,\"\",IF(Zuschlag!K30=0,\"\",Zuschlag!K30))","v":""},{"$f":"IF(K$48=Daten!$A$146,\"\",IF(Zuschlag!L30=0,\"\",Zuschlag!L30))","v":""},{"$f":"IF(L$48=Daten!$A$146,\"\",IF(Zuschlag!M30=0,\"\",Zuschlag!M30))","v":""},{"$f":"IF(M$48=Daten!$A$146,\"\",IF(Zuschlag!N30=0,\"\",Zuschlag!N30))","v":""},{"$f":"IF(N$48=Daten!$A$146,\"\",IF(Zuschlag!O30=0,\"\",Zuschlag!O30))","v":""},{"$f":"IF(O$48=Daten!$A$146,\"\",IF(Zuschlag!P30=0,\"\",Zuschlag!P30))","v":""},{"$f":"IF(P$48=Daten!$A$146,\"\",IF(Zuschlag!Q30=0,\"\",Zuschlag!Q30))","v":""},{"$f":"IF(Q$48=Daten!$A$146,\"\",IF(Zuschlag!R30=0,\"\",Zuschlag!R30))","v":""},{"$f":"IF(R$48=Daten!$A$146,\"\",IF(Zuschlag!S30=0,\"\",Zuschlag!S30))","v":""},{"$f":"IF(S$48=Daten!$A$146,\"\",IF(Zuschlag!T30=0,\"\",Zuschlag!T30))","v":""},{"$f":"IF(T$48=Daten!$A$146,\"\",IF(Zuschlag!U30=0,\"\",Zuschlag!U30))","v":""},{"$f":"IF(U$48=Daten!$A$146,\"\",IF(Zuschlag!V30=0,\"\",Zuschlag!V30))","v":""},{"$f":"IF(V$48=Daten!$A$146,\"\",IF(Zuschlag!W30=0,\"\",Zuschlag!W30))","v":""},{"$f":"IF(W$48=Daten!$A$146,\"\",IF(Zuschlag!X30=0,\"\",Zuschlag!X30))","v":""},{"$f":"IF(X$48=Daten!$A$146,\"\",IF(Zuschlag!Y30=0,\"\",Zuschlag!Y30))","v":""},{"$f":"IF(Y$48=Daten!$A$146,\"\",IF(Zuschlag!Z30=0,\"\",Zuschlag!Z30))","v":""},{"$f":"IF(Z$48=Daten!$A$146,\"\",IF(Zuschlag!AA30=0,\"\",Zuschlag!AA30))","v":""},{"$f":"IF(AA$48=Daten!$A$146,\"\",IF(Zuschlag!AB30=0,\"\",Zuschlag!AB30))","v":""},{"$f":"IF(AB$48=Daten!$A$146,\"\",IF(Zuschlag!AC30=0,\"\",Zuschlag!AC30))","v":""},{"$f":"IF(AC$48=Daten!$A$146,\"\",IF(Zuschlag!AD30=0,\"\",Zuschlag!AD30))","v":""},{"$f":"IF(AD$48=Daten!$A$146,\"\",IF(Zuschlag!AE30=0,\"\",Zuschlag!AE30))","v":""},{"$f":"IF(AE$48=Daten!$A$146,\"\",IF(Zuschlag!AF30=0,\"\",Zuschlag!AF30))","v":""},{"$f":"IF(AF$48=Daten!$A$146,\"\",IF(Zuschlag!AG30=0,\"\",Zuschlag!AG30))","v":""},{"$f":"IF(AG$48=Daten!$A$146,\"\",IF(Zuschlag!AH30=0,\"\",Zuschlag!AH30))","v":""},{"$f":"IF(AH$48=Daten!$A$146,\"\",IF(Zuschlag!AI30=0,\"\",Zuschlag!AI30))","v":""},{"$f":"IF(AI$48=Daten!$A$146,\"\",IF(Zuschlag!AJ30=0,\"\",Zuschlag!AJ30))","v":""},{"$f":"IF(AJ$48=Daten!$A$146,\"\",IF(Zuschlag!AK30=0,\"\",Zuschlag!AK30))","v":""},{"$f":"IF(AK$48=Daten!$A$146,\"\",IF(Zuschlag!AL30=0,\"\",Zuschlag!AL30))","v":""},{"$f":"IF(AL$48=Daten!$A$146,\"\",IF(Zuschlag!AM30=0,\"\",Zuschlag!AM30))","v":""},{"$f":"IF(AM$48=Daten!$A$146,\"\",IF(Zuschlag!AN30=0,\"\",Zuschlag!AN30))","v":""},{"$f":"IF(AN$48=Daten!$A$146,\"\",IF(Zuschlag!AO30=0,\"\",Zuschlag!AO30))","v":""},{"$f":"IF(AO$48=Daten!$A$146,\"\",IF(Zuschlag!AP30=0,\"\",Zuschlag!AP30))","v":""},{"$f":"IF(AP$48=Daten!$A$146,\"\",IF(Zuschlag!AQ30=0,\"\",Zuschlag!AQ30))","v":""},{"$f":"IF(AQ$48=Daten!$A$146,\"\",IF(Zuschlag!AR30=0,\"\",Zuschlag!AR30))","v":""}]
[{"$f":"Zuschlag!A31","v":0},{"$f":"Zuschlag!B31","v":0},"","",{"$f":"IF(E$48=Daten!$A$146,\"\",IF(Zuschlag!F31=0,\"\",Zuschlag!F31))","v":""},{"$f":"IF(F$48=Daten!$A$146,\"\",IF(Zuschlag!G31=0,\"\",Zuschlag!G31))","v":""},{"$f":"IF(G$48=Daten!$A$146,\"\",IF(Zuschlag!H31=0,\"\",Zuschlag!H31))","v":""},{"$f":"IF(H$48=Daten!$A$146,\"\",IF(Zuschlag!I31=0,\"\",Zuschlag!I31))","v":""},{"$f":"IF(I$48=Daten!$A$146,\"\",IF(Zuschlag!J31=0,\"\",Zuschlag!J31))","v":""},{"$f":"IF(J$48=Daten!$A$146,\"\",IF(Zuschlag!K31=0,\"\",Zuschlag!K31))","v":""},{"$f":"IF(K$48=Daten!$A$146,\"\",IF(Zuschlag!L31=0,\"\",Zuschlag!L31))","v":""},{"$f":"IF(L$48=Daten!$A$146,\"\",IF(Zuschlag!M31=0,\"\",Zuschlag!M31))","v":""},{"$f":"IF(M$48=Daten!$A$146,\"\",IF(Zuschlag!N31=0,\"\",Zuschlag!N31))","v":""},{"$f":"IF(N$48=Daten!$A$146,\"\",IF(Zuschlag!O31=0,\"\",Zuschlag!O31))","v":""},{"$f":"IF(O$48=Daten!$A$146,\"\",IF(Zuschlag!P31=0,\"\",Zuschlag!P31))","v":""},{"$f":"IF(P$48=Daten!$A$146,\"\",IF(Zuschlag!Q31=0,\"\",Zuschlag!Q31))","v":""},{"$f":"IF(Q$48=Daten!$A$146,\"\",IF(Zuschlag!R31=0,\"\",Zuschlag!R31))","v":""},{"$f":"IF(R$48=Daten!$A$146,\"\",IF(Zuschlag!S31=0,\"\",Zuschlag!S31))","v":""},{"$f":"IF(S$48=Daten!$A$146,\"\",IF(Zuschlag!T31=0,\"\",Zuschlag!T31))","v":""},{"$f":"IF(T$48=Daten!$A$146,\"\",IF(Zuschlag!U31=0,\"\",Zuschlag!U31))","v":""},{"$f":"IF(U$48=Daten!$A$146,\"\",IF(Zuschlag!V31=0,\"\",Zuschlag!V31))","v":""},{"$f":"IF(V$48=Daten!$A$146,\"\",IF(Zuschlag!W31=0,\"\",Zuschlag!W31))","v":""},{"$f":"IF(W$48=Daten!$A$146,\"\",IF(Zuschlag!X31=0,\"\",Zuschlag!X31))","v":""},{"$f":"IF(X$48=Daten!$A$146,\"\",IF(Zuschlag!Y31=0,\"\",Zuschlag!Y31))","v":""},{"$f":"IF(Y$48=Daten!$A$146,\"\",IF(Zuschlag!Z31=0,\"\",Zuschlag!Z31))","v":""},{"$f":"IF(Z$48=Daten!$A$146,\"\",IF(Zuschlag!AA31=0,\"\",Zuschlag!AA31))","v":""},{"$f":"IF(AA$48=Daten!$A$146,\"\",IF(Zuschlag!AB31=0,\"\",Zuschlag!AB31))","v":""},{"$f":"IF(AB$48=Daten!$A$146,\"\",IF(Zuschlag!AC31=0,\"\",Zuschlag!AC31))","v":""},{"$f":"IF(AC$48=Daten!$A$146,\"\",IF(Zuschlag!AD31=0,\"\",Zuschlag!AD31))","v":""},{"$f":"IF(AD$48=Daten!$A$146,\"\",IF(Zuschlag!AE31=0,\"\",Zuschlag!AE31))","v":""},{"$f":"IF(AE$48=Daten!$A$146,\"\",IF(Zuschlag!AF31=0,\"\",Zuschlag!AF31))","v":""},{"$f":"IF(AF$48=Daten!$A$146,\"\",IF(Zuschlag!AG31=0,\"\",Zuschlag!AG31))","v":""},{"$f":"IF(AG$48=Daten!$A$146,\"\",IF(Zuschlag!AH31=0,\"\",Zuschlag!AH31))","v":""},{"$f":"IF(AH$48=Daten!$A$146,\"\",IF(Zuschlag!AI31=0,\"\",Zuschlag!AI31))","v":""},{"$f":"IF(AI$48=Daten!$A$146,\"\",IF(Zuschlag!AJ31=0,\"\",Zuschlag!AJ31))","v":""},{"$f":"IF(AJ$48=Daten!$A$146,\"\",IF(Zuschlag!AK31=0,\"\",Zuschlag!AK31))","v":""},{"$f":"IF(AK$48=Daten!$A$146,\"\",IF(Zuschlag!AL31=0,\"\",Zuschlag!AL31))","v":""},{"$f":"IF(AL$48=Daten!$A$146,\"\",IF(Zuschlag!AM31=0,\"\",Zuschlag!AM31))","v":""},{"$f":"IF(AM$48=Daten!$A$146,\"\",IF(Zuschlag!AN31=0,\"\",Zuschlag!AN31))","v":""},{"$f":"IF(AN$48=Daten!$A$146,\"\",IF(Zuschlag!AO31=0,\"\",Zuschlag!AO31))","v":""},{"$f":"IF(AO$48=Daten!$A$146,\"\",IF(Zuschlag!AP31=0,\"\",Zuschlag!AP31))","v":""},{"$f":"IF(AP$48=Daten!$A$146,\"\",IF(Zuschlag!AQ31=0,\"\",Zuschlag!AQ31))","v":""},{"$f":"IF(AQ$48=Daten!$A$146,\"\",IF(Zuschlag!AR31=0,\"\",Zuschlag!AR31))","v":""}]
[{"$f":"Zuschlag!A32","v":3.10},{"$f":"Zuschlag!B32","v":"Z3.7 Termingewährleistung"},"Z3.7 Termingewährleistung","3.1) Z3.7 Termingewährleistung",{"$f":"IF(E$48=Daten!$A$146,\"\",IF(Zuschlag!F32=0,\"\",Zuschlag!F32))","v":""},{"$f":"IF(F$48=Daten!$A$146,\"\",IF(Zuschlag!G32=0,\"\",Zuschlag!G32))","v":""},{"$f":"IF(G$48=Daten!$A$146,\"\",IF(Zuschlag!H32=0,\"\",Zuschlag!H32))","v":""},{"$f":"IF(H$48=Daten!$A$146,\"\",IF(Zuschlag!I32=0,\"\",Zuschlag!I32))","v":""},{"$f":"IF(I$48=Daten!$A$146,\"\",IF(Zuschlag!J32=0,\"\",Zuschlag!J32))","v":""},{"$f":"IF(J$48=Daten!$A$146,\"\",IF(Zuschlag!K32=0,\"\",Zuschlag!K32))","v":""},{"$f":"IF(K$48=Daten!$A$146,\"\",IF(Zuschlag!L32=0,\"\",Zuschlag!L32))","v":""},{"$f":"IF(L$48=Daten!$A$146,\"\",IF(Zuschlag!M32=0,\"\",Zuschlag!M32))","v":""},{"$f":"IF(M$48=Daten!$A$146,\"\",IF(Zuschlag!N32=0,\"\",Zuschlag!N32))","v":""},{"$f":"IF(N$48=Daten!$A$146,\"\",IF(Zuschlag!O32=0,\"\",Zuschlag!O32))","v":""},{"$f":"IF(O$48=Daten!$A$146,\"\",IF(Zuschlag!P32=0,\"\",Zuschlag!P32))","v":""},{"$f":"IF(P$48=Daten!$A$146,\"\",IF(Zuschlag!Q32=0,\"\",Zuschlag!Q32))","v":""},{"$f":"IF(Q$48=Daten!$A$146,\"\",IF(Zuschlag!R32=0,\"\",Zuschlag!R32))","v":""},{"$f":"IF(R$48=Daten!$A$146,\"\",IF(Zuschlag!S32=0,\"\",Zuschlag!S32))","v":""},{"$f":"IF(S$48=Daten!$A$146,\"\",IF(Zuschlag!T32=0,\"\",Zuschlag!T32))","v":""},{"$f":"IF(T$48=Daten!$A$146,\"\",IF(Zuschlag!U32=0,\"\",Zuschlag!U32))","v":""},{"$f":"IF(U$48=Daten!$A$146,\"\",IF(Zuschlag!V32=0,\"\",Zuschlag!V32))","v":""},{"$f":"IF(V$48=Daten!$A$146,\"\",IF(Zuschlag!W32=0,\"\",Zuschlag!W32))","v":""},{"$f":"IF(W$48=Daten!$A$146,\"\",IF(Zuschlag!X32=0,\"\",Zuschlag!X32))","v":""},{"$f":"IF(X$48=Daten!$A$146,\"\",IF(Zuschlag!Y32=0,\"\",Zuschlag!Y32))","v":""},{"$f":"IF(Y$48=Daten!$A$146,\"\",IF(Zuschlag!Z32=0,\"\",Zuschlag!Z32))","v":""},{"$f":"IF(Z$48=Daten!$A$146,\"\",IF(Zuschlag!AA32=0,\"\",Zuschlag!AA32))","v":""},{"$f":"IF(AA$48=Daten!$A$146,\"\",IF(Zuschlag!AB32=0,\"\",Zuschlag!AB32))","v":""},{"$f":"IF(AB$48=Daten!$A$146,\"\",IF(Zuschlag!AC32=0,\"\",Zuschlag!AC32))","v":""},{"$f":"IF(AC$48=Daten!$A$146,\"\",IF(Zuschlag!AD32=0,\"\",Zuschlag!AD32))","v":""},{"$f":"IF(AD$48=Daten!$A$146,\"\",IF(Zuschlag!AE32=0,\"\",Zuschlag!AE32))","v":""},{"$f":"IF(AE$48=Daten!$A$146,\"\",IF(Zuschlag!AF32=0,\"\",Zuschlag!AF32))","v":""},{"$f":"IF(AF$48=Daten!$A$146,\"\",IF(Zuschlag!AG32=0,\"\",Zuschlag!AG32))","v":""},{"$f":"IF(AG$48=Daten!$A$146,\"\",IF(Zuschlag!AH32=0,\"\",Zuschlag!AH32))","v":""},{"$f":"IF(AH$48=Daten!$A$146,\"\",IF(Zuschlag!AI32=0,\"\",Zuschlag!AI32))","v":""},{"$f":"IF(AI$48=Daten!$A$146,\"\",IF(Zuschlag!AJ32=0,\"\",Zuschlag!AJ32))","v":""},{"$f":"IF(AJ$48=Daten!$A$146,\"\",IF(Zuschlag!AK32=0,\"\",Zuschlag!AK32))","v":""},{"$f":"IF(AK$48=Daten!$A$146,\"\",IF(Zuschlag!AL32=0,\"\",Zuschlag!AL32))","v":""},{"$f":"IF(AL$48=Daten!$A$146,\"\",IF(Zuschlag!AM32=0,\"\",Zuschlag!AM32))","v":""},{"$f":"IF(AM$48=Daten!$A$146,\"\",IF(Zuschlag!AN32=0,\"\",Zuschlag!AN32))","v":""},{"$f":"IF(AN$48=Daten!$A$146,\"\",IF(Zuschlag!AO32=0,\"\",Zuschlag!AO32))","v":""},{"$f":"IF(AO$48=Daten!$A$146,\"\",IF(Zuschlag!AP32=0,\"\",Zuschlag!AP32))","v":""},{"$f":"IF(AP$48=Daten!$A$146,\"\",IF(Zuschlag!AQ32=0,\"\",Zuschlag!AQ32))","v":""},{"$f":"IF(AQ$48=Daten!$A$146,\"\",IF(Zuschlag!AR32=0,\"\",Zuschlag!AR32))","v":""}]
[{"$f":"Zuschlag!A33","v":"3.2"},{"$f":"Zuschlag!B33","v":0},"","",{"$f":"IF(E$48=Daten!$A$146,\"\",IF(Zuschlag!F33=0,\"\",Zuschlag!F33))","v":""},{"$f":"IF(F$48=Daten!$A$146,\"\",IF(Zuschlag!G33=0,\"\",Zuschlag!G33))","v":""},{"$f":"IF(G$48=Daten!$A$146,\"\",IF(Zuschlag!H33=0,\"\",Zuschlag!H33))","v":""},{"$f":"IF(H$48=Daten!$A$146,\"\",IF(Zuschlag!I33=0,\"\",Zuschlag!I33))","v":""},{"$f":"IF(I$48=Daten!$A$146,\"\",IF(Zuschlag!J33=0,\"\",Zuschlag!J33))","v":""},{"$f":"IF(J$48=Daten!$A$146,\"\",IF(Zuschlag!K33=0,\"\",Zuschlag!K33))","v":""},{"$f":"IF(K$48=Daten!$A$146,\"\",IF(Zuschlag!L33=0,\"\",Zuschlag!L33))","v":""},{"$f":"IF(L$48=Daten!$A$146,\"\",IF(Zuschlag!M33=0,\"\",Zuschlag!M33))","v":""},{"$f":"IF(M$48=Daten!$A$146,\"\",IF(Zuschlag!N33=0,\"\",Zuschlag!N33))","v":""},{"$f":"IF(N$48=Daten!$A$146,\"\",IF(Zuschlag!O33=0,\"\",Zuschlag!O33))","v":""},{"$f":"IF(O$48=Daten!$A$146,\"\",IF(Zuschlag!P33=0,\"\",Zuschlag!P33))","v":""},{"$f":"IF(P$48=Daten!$A$146,\"\",IF(Zuschlag!Q33=0,\"\",Zuschlag!Q33))","v":""},{"$f":"IF(Q$48=Daten!$A$146,\"\",IF(Zuschlag!R33=0,\"\",Zuschlag!R33))","v":""},{"$f":"IF(R$48=Daten!$A$146,\"\",IF(Zuschlag!S33=0,\"\",Zuschlag!S33))","v":""},{"$f":"IF(S$48=Daten!$A$146,\"\",IF(Zuschlag!T33=0,\"\",Zuschlag!T33))","v":""},{"$f":"IF(T$48=Daten!$A$146,\"\",IF(Zuschlag!U33=0,\"\",Zuschlag!U33))","v":""},{"$f":"IF(U$48=Daten!$A$146,\"\",IF(Zuschlag!V33=0,\"\",Zuschlag!V33))","v":""},{"$f":"IF(V$48=Daten!$A$146,\"\",IF(Zuschlag!W33=0,\"\",Zuschlag!W33))","v":""},{"$f":"IF(W$48=Daten!$A$146,\"\",IF(Zuschlag!X33=0,\"\",Zuschlag!X33))","v":""},{"$f":"IF(X$48=Daten!$A$146,\"\",IF(Zuschlag!Y33=0,\"\",Zuschlag!Y33))","v":""},{"$f":"IF(Y$48=Daten!$A$146,\"\",IF(Zuschlag!Z33=0,\"\",Zuschlag!Z33))","v":""},{"$f":"IF(Z$48=Daten!$A$146,\"\",IF(Zuschlag!AA33=0,\"\",Zuschlag!AA33))","v":""},{"$f":"IF(AA$48=Daten!$A$146,\"\",IF(Zuschlag!AB33=0,\"\",Zuschlag!AB33))","v":""},{"$f":"IF(AB$48=Daten!$A$146,\"\",IF(Zuschlag!AC33=0,\"\",Zuschlag!AC33))","v":""},{"$f":"IF(AC$48=Daten!$A$146,\"\",IF(Zuschlag!AD33=0,\"\",Zuschlag!AD33))","v":""},{"$f":"IF(AD$48=Daten!$A$146,\"\",IF(Zuschlag!AE33=0,\"\",Zuschlag!AE33))","v":""},{"$f":"IF(AE$48=Daten!$A$146,\"\",IF(Zuschlag!AF33=0,\"\",Zuschlag!AF33))","v":""},{"$f":"IF(AF$48=Daten!$A$146,\"\",IF(Zuschlag!AG33=0,\"\",Zuschlag!AG33))","v":""},{"$f":"IF(AG$48=Daten!$A$146,\"\",IF(Zuschlag!AH33=0,\"\",Zuschlag!AH33))","v":""},{"$f":"IF(AH$48=Daten!$A$146,\"\",IF(Zuschlag!AI33=0,\"\",Zuschlag!AI33))","v":""},{"$f":"IF(AI$48=Daten!$A$146,\"\",IF(Zuschlag!AJ33=0,\"\",Zuschlag!AJ33))","v":""},{"$f":"IF(AJ$48=Daten!$A$146,\"\",IF(Zuschlag!AK33=0,\"\",Zuschlag!AK33))","v":""},{"$f":"IF(AK$48=Daten!$A$146,\"\",IF(Zuschlag!AL33=0,\"\",Zuschlag!AL33))","v":""},{"$f":"IF(AL$48=Daten!$A$146,\"\",IF(Zuschlag!AM33=0,\"\",Zuschlag!AM33))","v":""},{"$f":"IF(AM$48=Daten!$A$146,\"\",IF(Zuschlag!AN33=0,\"\",Zuschlag!AN33))","v":""},{"$f":"IF(AN$48=Daten!$A$146,\"\",IF(Zuschlag!AO33=0,\"\",Zuschlag!AO33))","v":""},{"$f":"IF(AO$48=Daten!$A$146,\"\",IF(Zuschlag!AP33=0,\"\",Zuschlag!AP33))","v":""},{"$f":"IF(AP$48=Daten!$A$146,\"\",IF(Zuschlag!AQ33=0,\"\",Zuschlag!AQ33))","v":""},{"$f":"IF(AQ$48=Daten!$A$146,\"\",IF(Zuschlag!AR33=0,\"\",Zuschlag!AR33))","v":""}]
[{"$f":"Zuschlag!A34","v":"3.3"},{"$f":"Zuschlag!B34","v":0},"","",{"$f":"IF(E$48=Daten!$A$146,\"\",IF(Zuschlag!F34=0,\"\",Zuschlag!F34))","v":""},{"$f":"IF(F$48=Daten!$A$146,\"\",IF(Zuschlag!G34=0,\"\",Zuschlag!G34))","v":""},{"$f":"IF(G$48=Daten!$A$146,\"\",IF(Zuschlag!H34=0,\"\",Zuschlag!H34))","v":""},{"$f":"IF(H$48=Daten!$A$146,\"\",IF(Zuschlag!I34=0,\"\",Zuschlag!I34))","v":""},{"$f":"IF(I$48=Daten!$A$146,\"\",IF(Zuschlag!J34=0,\"\",Zuschlag!J34))","v":""},{"$f":"IF(J$48=Daten!$A$146,\"\",IF(Zuschlag!K34=0,\"\",Zuschlag!K34))","v":""},{"$f":"IF(K$48=Daten!$A$146,\"\",IF(Zuschlag!L34=0,\"\",Zuschlag!L34))","v":""},{"$f":"IF(L$48=Daten!$A$146,\"\",IF(Zuschlag!M34=0,\"\",Zuschlag!M34))","v":""},{"$f":"IF(M$48=Daten!$A$146,\"\",IF(Zuschlag!N34=0,\"\",Zuschlag!N34))","v":""},{"$f":"IF(N$48=Daten!$A$146,\"\",IF(Zuschlag!O34=0,\"\",Zuschlag!O34))","v":""},{"$f":"IF(O$48=Daten!$A$146,\"\",IF(Zuschlag!P34=0,\"\",Zuschlag!P34))","v":""},{"$f":"IF(P$48=Daten!$A$146,\"\",IF(Zuschlag!Q34=0,\"\",Zuschlag!Q34))","v":""},{"$f":"IF(Q$48=Daten!$A$146,\"\",IF(Zuschlag!R34=0,\"\",Zuschlag!R34))","v":""},{"$f":"IF(R$48=Daten!$A$146,\"\",IF(Zuschlag!S34=0,\"\",Zuschlag!S34))","v":""},{"$f":"IF(S$48=Daten!$A$146,\"\",IF(Zuschlag!T34=0,\"\",Zuschlag!T34))","v":""},{"$f":"IF(T$48=Daten!$A$146,\"\",IF(Zuschlag!U34=0,\"\",Zuschlag!U34))","v":""},{"$f":"IF(U$48=Daten!$A$146,\"\",IF(Zuschlag!V34=0,\"\",Zuschlag!V34))","v":""},{"$f":"IF(V$48=Daten!$A$146,\"\",IF(Zuschlag!W34=0,\"\",Zuschlag!W34))","v":""},{"$f":"IF(W$48=Daten!$A$146,\"\",IF(Zuschlag!X34=0,\"\",Zuschlag!X34))","v":""},{"$f":"IF(X$48=Daten!$A$146,\"\",IF(Zuschlag!Y34=0,\"\",Zuschlag!Y34))","v":""},{"$f":"IF(Y$48=Daten!$A$146,\"\",IF(Zuschlag!Z34=0,\"\",Zuschlag!Z34))","v":""},{"$f":"IF(Z$48=Daten!$A$146,\"\",IF(Zuschlag!AA34=0,\"\",Zuschlag!AA34))","v":""},{"$f":"IF(AA$48=Daten!$A$146,\"\",IF(Zuschlag!AB34=0,\"\",Zuschlag!AB34))","v":""},{"$f":"IF(AB$48=Daten!$A$146,\"\",IF(Zuschlag!AC34=0,\"\",Zuschlag!AC34))","v":""},{"$f":"IF(AC$48=Daten!$A$146,\"\",IF(Zuschlag!AD34=0,\"\",Zuschlag!AD34))","v":""},{"$f":"IF(AD$48=Daten!$A$146,\"\",IF(Zuschlag!AE34=0,\"\",Zuschlag!AE34))","v":""},{"$f":"IF(AE$48=Daten!$A$146,\"\",IF(Zuschlag!AF34=0,\"\",Zuschlag!AF34))","v":""},{"$f":"IF(AF$48=Daten!$A$146,\"\",IF(Zuschlag!AG34=0,\"\",Zuschlag!AG34))","v":""},{"$f":"IF(AG$48=Daten!$A$146,\"\",IF(Zuschlag!AH34=0,\"\",Zuschlag!AH34))","v":""},{"$f":"IF(AH$48=Daten!$A$146,\"\",IF(Zuschlag!AI34=0,\"\",Zuschlag!AI34))","v":""},{"$f":"IF(AI$48=Daten!$A$146,\"\",IF(Zuschlag!AJ34=0,\"\",Zuschlag!AJ34))","v":""},{"$f":"IF(AJ$48=Daten!$A$146,\"\",IF(Zuschlag!AK34=0,\"\",Zuschlag!AK34))","v":""},{"$f":"IF(AK$48=Daten!$A$146,\"\",IF(Zuschlag!AL34=0,\"\",Zuschlag!AL34))","v":""},{"$f":"IF(AL$48=Daten!$A$146,\"\",IF(Zuschlag!AM34=0,\"\",Zuschlag!AM34))","v":""},{"$f":"IF(AM$48=Daten!$A$146,\"\",IF(Zuschlag!AN34=0,\"\",Zuschlag!AN34))","v":""},{"$f":"IF(AN$48=Daten!$A$146,\"\",IF(Zuschlag!AO34=0,\"\",Zuschlag!AO34))","v":""},{"$f":"IF(AO$48=Daten!$A$146,\"\",IF(Zuschlag!AP34=0,\"\",Zuschlag!AP34))","v":""},{"$f":"IF(AP$48=Daten!$A$146,\"\",IF(Zuschlag!AQ34=0,\"\",Zuschlag!AQ34))","v":""},{"$f":"IF(AQ$48=Daten!$A$146,\"\",IF(Zuschlag!AR34=0,\"\",Zuschlag!AR34))","v":""}]
[{"$f":"Zuschlag!A35","v":"3.4"},{"$f":"Zuschlag!B35","v":0},"","",{"$f":"IF(E$48=Daten!$A$146,\"\",IF(Zuschlag!F35=0,\"\",Zuschlag!F35))","v":""},{"$f":"IF(F$48=Daten!$A$146,\"\",IF(Zuschlag!G35=0,\"\",Zuschlag!G35))","v":""},{"$f":"IF(G$48=Daten!$A$146,\"\",IF(Zuschlag!H35=0,\"\",Zuschlag!H35))","v":""},{"$f":"IF(H$48=Daten!$A$146,\"\",IF(Zuschlag!I35=0,\"\",Zuschlag!I35))","v":""},{"$f":"IF(I$48=Daten!$A$146,\"\",IF(Zuschlag!J35=0,\"\",Zuschlag!J35))","v":""},{"$f":"IF(J$48=Daten!$A$146,\"\",IF(Zuschlag!K35=0,\"\",Zuschlag!K35))","v":""},{"$f":"IF(K$48=Daten!$A$146,\"\",IF(Zuschlag!L35=0,\"\",Zuschlag!L35))","v":""},{"$f":"IF(L$48=Daten!$A$146,\"\",IF(Zuschlag!M35=0,\"\",Zuschlag!M35))","v":""},{"$f":"IF(M$48=Daten!$A$146,\"\",IF(Zuschlag!N35=0,\"\",Zuschlag!N35))","v":""},{"$f":"IF(N$48=Daten!$A$146,\"\",IF(Zuschlag!O35=0,\"\",Zuschlag!O35))","v":""},{"$f":"IF(O$48=Daten!$A$146,\"\",IF(Zuschlag!P35=0,\"\",Zuschlag!P35))","v":""},{"$f":"IF(P$48=Daten!$A$146,\"\",IF(Zuschlag!Q35=0,\"\",Zuschlag!Q35))","v":""},{"$f":"IF(Q$48=Daten!$A$146,\"\",IF(Zuschlag!R35=0,\"\",Zuschlag!R35))","v":""},{"$f":"IF(R$48=Daten!$A$146,\"\",IF(Zuschlag!S35=0,\"\",Zuschlag!S35))","v":""},{"$f":"IF(S$48=Daten!$A$146,\"\",IF(Zuschlag!T35=0,\"\",Zuschlag!T35))","v":""},{"$f":"IF(T$48=Daten!$A$146,\"\",IF(Zuschlag!U35=0,\"\",Zuschlag!U35))","v":""},{"$f":"IF(U$48=Daten!$A$146,\"\",IF(Zuschlag!V35=0,\"\",Zuschlag!V35))","v":""},{"$f":"IF(V$48=Daten!$A$146,\"\",IF(Zuschlag!W35=0,\"\",Zuschlag!W35))","v":""},{"$f":"IF(W$48=Daten!$A$146,\"\",IF(Zuschlag!X35=0,\"\",Zuschlag!X35))","v":""},{"$f":"IF(X$48=Daten!$A$146,\"\",IF(Zuschlag!Y35=0,\"\",Zuschlag!Y35))","v":""},{"$f":"IF(Y$48=Daten!$A$146,\"\",IF(Zuschlag!Z35=0,\"\",Zuschlag!Z35))","v":""},{"$f":"IF(Z$48=Daten!$A$146,\"\",IF(Zuschlag!AA35=0,\"\",Zuschlag!AA35))","v":""},{"$f":"IF(AA$48=Daten!$A$146,\"\",IF(Zuschlag!AB35=0,\"\",Zuschlag!AB35))","v":""},{"$f":"IF(AB$48=Daten!$A$146,\"\",IF(Zuschlag!AC35=0,\"\",Zuschlag!AC35))","v":""},{"$f":"IF(AC$48=Daten!$A$146,\"\",IF(Zuschlag!AD35=0,\"\",Zuschlag!AD35))","v":""},{"$f":"IF(AD$48=Daten!$A$146,\"\",IF(Zuschlag!AE35=0,\"\",Zuschlag!AE35))","v":""},{"$f":"IF(AE$48=Daten!$A$146,\"\",IF(Zuschlag!AF35=0,\"\",Zuschlag!AF35))","v":""},{"$f":"IF(AF$48=Daten!$A$146,\"\",IF(Zuschlag!AG35=0,\"\",Zuschlag!AG35))","v":""},{"$f":"IF(AG$48=Daten!$A$146,\"\",IF(Zuschlag!AH35=0,\"\",Zuschlag!AH35))","v":""},{"$f":"IF(AH$48=Daten!$A$146,\"\",IF(Zuschlag!AI35=0,\"\",Zuschlag!AI35))","v":""},{"$f":"IF(AI$48=Daten!$A$146,\"\",IF(Zuschlag!AJ35=0,\"\",Zuschlag!AJ35))","v":""},{"$f":"IF(AJ$48=Daten!$A$146,\"\",IF(Zuschlag!AK35=0,\"\",Zuschlag!AK35))","v":""},{"$f":"IF(AK$48=Daten!$A$146,\"\",IF(Zuschlag!AL35=0,\"\",Zuschlag!AL35))","v":""},{"$f":"IF(AL$48=Daten!$A$146,\"\",IF(Zuschlag!AM35=0,\"\",Zuschlag!AM35))","v":""},{"$f":"IF(AM$48=Daten!$A$146,\"\",IF(Zuschlag!AN35=0,\"\",Zuschlag!AN35))","v":""},{"$f":"IF(AN$48=Daten!$A$146,\"\",IF(Zuschlag!AO35=0,\"\",Zuschlag!AO35))","v":""},{"$f":"IF(AO$48=Daten!$A$146,\"\",IF(Zuschlag!AP35=0,\"\",Zuschlag!AP35))","v":""},{"$f":"IF(AP$48=Daten!$A$146,\"\",IF(Zuschlag!AQ35=0,\"\",Zuschlag!AQ35))","v":""},{"$f":"IF(AQ$48=Daten!$A$146,\"\",IF(Zuschlag!AR35=0,\"\",Zuschlag!AR35))","v":""}]
[{"$f":"Zuschlag!A36","v":0},{"$f":"Zuschlag!B36","v":0},"","",{"$f":"IF(E$48=Daten!$A$146,\"\",IF(Zuschlag!F36=0,\"\",Zuschlag!F36))","v":""},{"$f":"IF(F$48=Daten!$A$146,\"\",IF(Zuschlag!G36=0,\"\",Zuschlag!G36))","v":""},{"$f":"IF(G$48=Daten!$A$146,\"\",IF(Zuschlag!H36=0,\"\",Zuschlag!H36))","v":""},{"$f":"IF(H$48=Daten!$A$146,\"\",IF(Zuschlag!I36=0,\"\",Zuschlag!I36))","v":""},{"$f":"IF(I$48=Daten!$A$146,\"\",IF(Zuschlag!J36=0,\"\",Zuschlag!J36))","v":""},{"$f":"IF(J$48=Daten!$A$146,\"\",IF(Zuschlag!K36=0,\"\",Zuschlag!K36))","v":""},{"$f":"IF(K$48=Daten!$A$146,\"\",IF(Zuschlag!L36=0,\"\",Zuschlag!L36))","v":""},{"$f":"IF(L$48=Daten!$A$146,\"\",IF(Zuschlag!M36=0,\"\",Zuschlag!M36))","v":""},{"$f":"IF(M$48=Daten!$A$146,\"\",IF(Zuschlag!N36=0,\"\",Zuschlag!N36))","v":""},{"$f":"IF(N$48=Daten!$A$146,\"\",IF(Zuschlag!O36=0,\"\",Zuschlag!O36))","v":""},{"$f":"IF(O$48=Daten!$A$146,\"\",IF(Zuschlag!P36=0,\"\",Zuschlag!P36))","v":""},{"$f":"IF(P$48=Daten!$A$146,\"\",IF(Zuschlag!Q36=0,\"\",Zuschlag!Q36))","v":""},{"$f":"IF(Q$48=Daten!$A$146,\"\",IF(Zuschlag!R36=0,\"\",Zuschlag!R36))","v":""},{"$f":"IF(R$48=Daten!$A$146,\"\",IF(Zuschlag!S36=0,\"\",Zuschlag!S36))","v":""},{"$f":"IF(S$48=Daten!$A$146,\"\",IF(Zuschlag!T36=0,\"\",Zuschlag!T36))","v":""},{"$f":"IF(T$48=Daten!$A$146,\"\",IF(Zuschlag!U36=0,\"\",Zuschlag!U36))","v":""},{"$f":"IF(U$48=Daten!$A$146,\"\",IF(Zuschlag!V36=0,\"\",Zuschlag!V36))","v":""},{"$f":"IF(V$48=Daten!$A$146,\"\",IF(Zuschlag!W36=0,\"\",Zuschlag!W36))","v":""},{"$f":"IF(W$48=Daten!$A$146,\"\",IF(Zuschlag!X36=0,\"\",Zuschlag!X36))","v":""},{"$f":"IF(X$48=Daten!$A$146,\"\",IF(Zuschlag!Y36=0,\"\",Zuschlag!Y36))","v":""},{"$f":"IF(Y$48=Daten!$A$146,\"\",IF(Zuschlag!Z36=0,\"\",Zuschlag!Z36))","v":""},{"$f":"IF(Z$48=Daten!$A$146,\"\",IF(Zuschlag!AA36=0,\"\",Zuschlag!AA36))","v":""},{"$f":"IF(AA$48=Daten!$A$146,\"\",IF(Zuschlag!AB36=0,\"\",Zuschlag!AB36))","v":""},{"$f":"IF(AB$48=Daten!$A$146,\"\",IF(Zuschlag!AC36=0,\"\",Zuschlag!AC36))","v":""},{"$f":"IF(AC$48=Daten!$A$146,\"\",IF(Zuschlag!AD36=0,\"\",Zuschlag!AD36))","v":""},{"$f":"IF(AD$48=Daten!$A$146,\"\",IF(Zuschlag!AE36=0,\"\",Zuschlag!AE36))","v":""},{"$f":"IF(AE$48=Daten!$A$146,\"\",IF(Zuschlag!AF36=0,\"\",Zuschlag!AF36))","v":""},{"$f":"IF(AF$48=Daten!$A$146,\"\",IF(Zuschlag!AG36=0,\"\",Zuschlag!AG36))","v":""},{"$f":"IF(AG$48=Daten!$A$146,\"\",IF(Zuschlag!AH36=0,\"\",Zuschlag!AH36))","v":""},{"$f":"IF(AH$48=Daten!$A$146,\"\",IF(Zuschlag!AI36=0,\"\",Zuschlag!AI36))","v":""},{"$f":"IF(AI$48=Daten!$A$146,\"\",IF(Zuschlag!AJ36=0,\"\",Zuschlag!AJ36))","v":""},{"$f":"IF(AJ$48=Daten!$A$146,\"\",IF(Zuschlag!AK36=0,\"\",Zuschlag!AK36))","v":""},{"$f":"IF(AK$48=Daten!$A$146,\"\",IF(Zuschlag!AL36=0,\"\",Zuschlag!AL36))","v":""},{"$f":"IF(AL$48=Daten!$A$146,\"\",IF(Zuschlag!AM36=0,\"\",Zuschlag!AM36))","v":""},{"$f":"IF(AM$48=Daten!$A$146,\"\",IF(Zuschlag!AN36=0,\"\",Zuschlag!AN36))","v":""},{"$f":"IF(AN$48=Daten!$A$146,\"\",IF(Zuschlag!AO36=0,\"\",Zuschlag!AO36))","v":""},{"$f":"IF(AO$48=Daten!$A$146,\"\",IF(Zuschlag!AP36=0,\"\",Zuschlag!AP36))","v":""},{"$f":"IF(AP$48=Daten!$A$146,\"\",IF(Zuschlag!AQ36=0,\"\",Zuschlag!AQ36))","v":""},{"$f":"IF(AQ$48=Daten!$A$146,\"\",IF(Zuschlag!AR36=0,\"\",Zuschlag!AR36))","v":""}]
[{"$f":"Zuschlag!A37","v":"4"},{"$f":"Zuschlag!B37","v":0},"","",{"$f":"IF(E$48=Daten!$A$146,\"\",IF(Zuschlag!F37=0,\"\",Zuschlag!F37))","v":""},{"$f":"IF(F$48=Daten!$A$146,\"\",IF(Zuschlag!G37=0,\"\",Zuschlag!G37))","v":""},{"$f":"IF(G$48=Daten!$A$146,\"\",IF(Zuschlag!H37=0,\"\",Zuschlag!H37))","v":""},{"$f":"IF(H$48=Daten!$A$146,\"\",IF(Zuschlag!I37=0,\"\",Zuschlag!I37))","v":""},{"$f":"IF(I$48=Daten!$A$146,\"\",IF(Zuschlag!J37=0,\"\",Zuschlag!J37))","v":""},{"$f":"IF(J$48=Daten!$A$146,\"\",IF(Zuschlag!K37=0,\"\",Zuschlag!K37))","v":""},{"$f":"IF(K$48=Daten!$A$146,\"\",IF(Zuschlag!L37=0,\"\",Zuschlag!L37))","v":""},{"$f":"IF(L$48=Daten!$A$146,\"\",IF(Zuschlag!M37=0,\"\",Zuschlag!M37))","v":""},{"$f":"IF(M$48=Daten!$A$146,\"\",IF(Zuschlag!N37=0,\"\",Zuschlag!N37))","v":""},{"$f":"IF(N$48=Daten!$A$146,\"\",IF(Zuschlag!O37=0,\"\",Zuschlag!O37))","v":""},{"$f":"IF(O$48=Daten!$A$146,\"\",IF(Zuschlag!P37=0,\"\",Zuschlag!P37))","v":""},{"$f":"IF(P$48=Daten!$A$146,\"\",IF(Zuschlag!Q37=0,\"\",Zuschlag!Q37))","v":""},{"$f":"IF(Q$48=Daten!$A$146,\"\",IF(Zuschlag!R37=0,\"\",Zuschlag!R37))","v":""},{"$f":"IF(R$48=Daten!$A$146,\"\",IF(Zuschlag!S37=0,\"\",Zuschlag!S37))","v":""},{"$f":"IF(S$48=Daten!$A$146,\"\",IF(Zuschlag!T37=0,\"\",Zuschlag!T37))","v":""},{"$f":"IF(T$48=Daten!$A$146,\"\",IF(Zuschlag!U37=0,\"\",Zuschlag!U37))","v":""},{"$f":"IF(U$48=Daten!$A$146,\"\",IF(Zuschlag!V37=0,\"\",Zuschlag!V37))","v":""},{"$f":"IF(V$48=Daten!$A$146,\"\",IF(Zuschlag!W37=0,\"\",Zuschlag!W37))","v":""},{"$f":"IF(W$48=Daten!$A$146,\"\",IF(Zuschlag!X37=0,\"\",Zuschlag!X37))","v":""},{"$f":"IF(X$48=Daten!$A$146,\"\",IF(Zuschlag!Y37=0,\"\",Zuschlag!Y37))","v":""},{"$f":"IF(Y$48=Daten!$A$146,\"\",IF(Zuschlag!Z37=0,\"\",Zuschlag!Z37))","v":""},{"$f":"IF(Z$48=Daten!$A$146,\"\",IF(Zuschlag!AA37=0,\"\",Zuschlag!AA37))","v":""},{"$f":"IF(AA$48=Daten!$A$146,\"\",IF(Zuschlag!AB37=0,\"\",Zuschlag!AB37))","v":""},{"$f":"IF(AB$48=Daten!$A$146,\"\",IF(Zuschlag!AC37=0,\"\",Zuschlag!AC37))","v":""},{"$f":"IF(AC$48=Daten!$A$146,\"\",IF(Zuschlag!AD37=0,\"\",Zuschlag!AD37))","v":""},{"$f":"IF(AD$48=Daten!$A$146,\"\",IF(Zuschlag!AE37=0,\"\",Zuschlag!AE37))","v":""},{"$f":"IF(AE$48=Daten!$A$146,\"\",IF(Zuschlag!AF37=0,\"\",Zuschlag!AF37))","v":""},{"$f":"IF(AF$48=Daten!$A$146,\"\",IF(Zuschlag!AG37=0,\"\",Zuschlag!AG37))","v":""},{"$f":"IF(AG$48=Daten!$A$146,\"\",IF(Zuschlag!AH37=0,\"\",Zuschlag!AH37))","v":""},{"$f":"IF(AH$48=Daten!$A$146,\"\",IF(Zuschlag!AI37=0,\"\",Zuschlag!AI37))","v":""},{"$f":"IF(AI$48=Daten!$A$146,\"\",IF(Zuschlag!AJ37=0,\"\",Zuschlag!AJ37))","v":""},{"$f":"IF(AJ$48=Daten!$A$146,\"\",IF(Zuschlag!AK37=0,\"\",Zuschlag!AK37))","v":""},{"$f":"IF(AK$48=Daten!$A$146,\"\",IF(Zuschlag!AL37=0,\"\",Zuschlag!AL37))","v":""},{"$f":"IF(AL$48=Daten!$A$146,\"\",IF(Zuschlag!AM37=0,\"\",Zuschlag!AM37))","v":""},{"$f":"IF(AM$48=Daten!$A$146,\"\",IF(Zuschlag!AN37=0,\"\",Zuschlag!AN37))","v":""},{"$f":"IF(AN$48=Daten!$A$146,\"\",IF(Zuschlag!AO37=0,\"\",Zuschlag!AO37))","v":""},{"$f":"IF(AO$48=Daten!$A$146,\"\",IF(Zuschlag!AP37=0,\"\",Zuschlag!AP37))","v":""},{"$f":"IF(AP$48=Daten!$A$146,\"\",IF(Zuschlag!AQ37=0,\"\",Zuschlag!AQ37))","v":""},{"$f":"IF(AQ$48=Daten!$A$146,\"\",IF(Zuschlag!AR37=0,\"\",Zuschlag!AR37))","v":""}]
[{"$f":"Zuschlag!A38","v":0},{"$f":"Zuschlag!B38","v":0},"","",{"$f":"IF(E$48=Daten!$A$146,\"\",IF(Zuschlag!F38=0,\"\",Zuschlag!F38))","v":""},{"$f":"IF(F$48=Daten!$A$146,\"\",IF(Zuschlag!G38=0,\"\",Zuschlag!G38))","v":""},{"$f":"IF(G$48=Daten!$A$146,\"\",IF(Zuschlag!H38=0,\"\",Zuschlag!H38))","v":""},{"$f":"IF(H$48=Daten!$A$146,\"\",IF(Zuschlag!I38=0,\"\",Zuschlag!I38))","v":""},{"$f":"IF(I$48=Daten!$A$146,\"\",IF(Zuschlag!J38=0,\"\",Zuschlag!J38))","v":""},{"$f":"IF(J$48=Daten!$A$146,\"\",IF(Zuschlag!K38=0,\"\",Zuschlag!K38))","v":""},{"$f":"IF(K$48=Daten!$A$146,\"\",IF(Zuschlag!L38=0,\"\",Zuschlag!L38))","v":""},{"$f":"IF(L$48=Daten!$A$146,\"\",IF(Zuschlag!M38=0,\"\",Zuschlag!M38))","v":""},{"$f":"IF(M$48=Daten!$A$146,\"\",IF(Zuschlag!N38=0,\"\",Zuschlag!N38))","v":""},{"$f":"IF(N$48=Daten!$A$146,\"\",IF(Zuschlag!O38=0,\"\",Zuschlag!O38))","v":""},{"$f":"IF(O$48=Daten!$A$146,\"\",IF(Zuschlag!P38=0,\"\",Zuschlag!P38))","v":""},{"$f":"IF(P$48=Daten!$A$146,\"\",IF(Zuschlag!Q38=0,\"\",Zuschlag!Q38))","v":""},{"$f":"IF(Q$48=Daten!$A$146,\"\",IF(Zuschlag!R38=0,\"\",Zuschlag!R38))","v":""},{"$f":"IF(R$48=Daten!$A$146,\"\",IF(Zuschlag!S38=0,\"\",Zuschlag!S38))","v":""},{"$f":"IF(S$48=Daten!$A$146,\"\",IF(Zuschlag!T38=0,\"\",Zuschlag!T38))","v":""},{"$f":"IF(T$48=Daten!$A$146,\"\",IF(Zuschlag!U38=0,\"\",Zuschlag!U38))","v":""},{"$f":"IF(U$48=Daten!$A$146,\"\",IF(Zuschlag!V38=0,\"\",Zuschlag!V38))","v":""},{"$f":"IF(V$48=Daten!$A$146,\"\",IF(Zuschlag!W38=0,\"\",Zuschlag!W38))","v":""},{"$f":"IF(W$48=Daten!$A$146,\"\",IF(Zuschlag!X38=0,\"\",Zuschlag!X38))","v":""},{"$f":"IF(X$48=Daten!$A$146,\"\",IF(Zuschlag!Y38=0,\"\",Zuschlag!Y38))","v":""},{"$f":"IF(Y$48=Daten!$A$146,\"\",IF(Zuschlag!Z38=0,\"\",Zuschlag!Z38))","v":""},{"$f":"IF(Z$48=Daten!$A$146,\"\",IF(Zuschlag!AA38=0,\"\",Zuschlag!AA38))","v":""},{"$f":"IF(AA$48=Daten!$A$146,\"\",IF(Zuschlag!AB38=0,\"\",Zuschlag!AB38))","v":""},{"$f":"IF(AB$48=Daten!$A$146,\"\",IF(Zuschlag!AC38=0,\"\",Zuschlag!AC38))","v":""},{"$f":"IF(AC$48=Daten!$A$146,\"\",IF(Zuschlag!AD38=0,\"\",Zuschlag!AD38))","v":""},{"$f":"IF(AD$48=Daten!$A$146,\"\",IF(Zuschlag!AE38=0,\"\",Zuschlag!AE38))","v":""},{"$f":"IF(AE$48=Daten!$A$146,\"\",IF(Zuschlag!AF38=0,\"\",Zuschlag!AF38))","v":""},{"$f":"IF(AF$48=Daten!$A$146,\"\",IF(Zuschlag!AG38=0,\"\",Zuschlag!AG38))","v":""},{"$f":"IF(AG$48=Daten!$A$146,\"\",IF(Zuschlag!AH38=0,\"\",Zuschlag!AH38))","v":""},{"$f":"IF(AH$48=Daten!$A$146,\"\",IF(Zuschlag!AI38=0,\"\",Zuschlag!AI38))","v":""},{"$f":"IF(AI$48=Daten!$A$146,\"\",IF(Zuschlag!AJ38=0,\"\",Zuschlag!AJ38))","v":""},{"$f":"IF(AJ$48=Daten!$A$146,\"\",IF(Zuschlag!AK38=0,\"\",Zuschlag!AK38))","v":""},{"$f":"IF(AK$48=Daten!$A$146,\"\",IF(Zuschlag!AL38=0,\"\",Zuschlag!AL38))","v":""},{"$f":"IF(AL$48=Daten!$A$146,\"\",IF(Zuschlag!AM38=0,\"\",Zuschlag!AM38))","v":""},{"$f":"IF(AM$48=Daten!$A$146,\"\",IF(Zuschlag!AN38=0,\"\",Zuschlag!AN38))","v":""},{"$f":"IF(AN$48=Daten!$A$146,\"\",IF(Zuschlag!AO38=0,\"\",Zuschlag!AO38))","v":""},{"$f":"IF(AO$48=Daten!$A$146,\"\",IF(Zuschlag!AP38=0,\"\",Zuschlag!AP38))","v":""},{"$f":"IF(AP$48=Daten!$A$146,\"\",IF(Zuschlag!AQ38=0,\"\",Zuschlag!AQ38))","v":""},{"$f":"IF(AQ$48=Daten!$A$146,\"\",IF(Zuschlag!AR38=0,\"\",Zuschlag!AR38))","v":""}]
[{"$f":"Zuschlag!A39","v":"4.1"},{"$f":"Zuschlag!B39","v":0},"","",{"$f":"IF(E$48=Daten!$A$146,\"\",IF(Zuschlag!F39=0,\"\",Zuschlag!F39))","v":""},{"$f":"IF(F$48=Daten!$A$146,\"\",IF(Zuschlag!G39=0,\"\",Zuschlag!G39))","v":""},{"$f":"IF(G$48=Daten!$A$146,\"\",IF(Zuschlag!H39=0,\"\",Zuschlag!H39))","v":""},{"$f":"IF(H$48=Daten!$A$146,\"\",IF(Zuschlag!I39=0,\"\",Zuschlag!I39))","v":""},{"$f":"IF(I$48=Daten!$A$146,\"\",IF(Zuschlag!J39=0,\"\",Zuschlag!J39))","v":""},{"$f":"IF(J$48=Daten!$A$146,\"\",IF(Zuschlag!K39=0,\"\",Zuschlag!K39))","v":""},{"$f":"IF(K$48=Daten!$A$146,\"\",IF(Zuschlag!L39=0,\"\",Zuschlag!L39))","v":""},{"$f":"IF(L$48=Daten!$A$146,\"\",IF(Zuschlag!M39=0,\"\",Zuschlag!M39))","v":""},{"$f":"IF(M$48=Daten!$A$146,\"\",IF(Zuschlag!N39=0,\"\",Zuschlag!N39))","v":""},{"$f":"IF(N$48=Daten!$A$146,\"\",IF(Zuschlag!O39=0,\"\",Zuschlag!O39))","v":""},{"$f":"IF(O$48=Daten!$A$146,\"\",IF(Zuschlag!P39=0,\"\",Zuschlag!P39))","v":""},{"$f":"IF(P$48=Daten!$A$146,\"\",IF(Zuschlag!Q39=0,\"\",Zuschlag!Q39))","v":""},{"$f":"IF(Q$48=Daten!$A$146,\"\",IF(Zuschlag!R39=0,\"\",Zuschlag!R39))","v":""},{"$f":"IF(R$48=Daten!$A$146,\"\",IF(Zuschlag!S39=0,\"\",Zuschlag!S39))","v":""},{"$f":"IF(S$48=Daten!$A$146,\"\",IF(Zuschlag!T39=0,\"\",Zuschlag!T39))","v":""},{"$f":"IF(T$48=Daten!$A$146,\"\",IF(Zuschlag!U39=0,\"\",Zuschlag!U39))","v":""},{"$f":"IF(U$48=Daten!$A$146,\"\",IF(Zuschlag!V39=0,\"\",Zuschlag!V39))","v":""},{"$f":"IF(V$48=Daten!$A$146,\"\",IF(Zuschlag!W39=0,\"\",Zuschlag!W39))","v":""},{"$f":"IF(W$48=Daten!$A$146,\"\",IF(Zuschlag!X39=0,\"\",Zuschlag!X39))","v":""},{"$f":"IF(X$48=Daten!$A$146,\"\",IF(Zuschlag!Y39=0,\"\",Zuschlag!Y39))","v":""},{"$f":"IF(Y$48=Daten!$A$146,\"\",IF(Zuschlag!Z39=0,\"\",Zuschlag!Z39))","v":""},{"$f":"IF(Z$48=Daten!$A$146,\"\",IF(Zuschlag!AA39=0,\"\",Zuschlag!AA39))","v":""},{"$f":"IF(AA$48=Daten!$A$146,\"\",IF(Zuschlag!AB39=0,\"\",Zuschlag!AB39))","v":""},{"$f":"IF(AB$48=Daten!$A$146,\"\",IF(Zuschlag!AC39=0,\"\",Zuschlag!AC39))","v":""},{"$f":"IF(AC$48=Daten!$A$146,\"\",IF(Zuschlag!AD39=0,\"\",Zuschlag!AD39))","v":""},{"$f":"IF(AD$48=Daten!$A$146,\"\",IF(Zuschlag!AE39=0,\"\",Zuschlag!AE39))","v":""},{"$f":"IF(AE$48=Daten!$A$146,\"\",IF(Zuschlag!AF39=0,\"\",Zuschlag!AF39))","v":""},{"$f":"IF(AF$48=Daten!$A$146,\"\",IF(Zuschlag!AG39=0,\"\",Zuschlag!AG39))","v":""},{"$f":"IF(AG$48=Daten!$A$146,\"\",IF(Zuschlag!AH39=0,\"\",Zuschlag!AH39))","v":""},{"$f":"IF(AH$48=Daten!$A$146,\"\",IF(Zuschlag!AI39=0,\"\",Zuschlag!AI39))","v":""},{"$f":"IF(AI$48=Daten!$A$146,\"\",IF(Zuschlag!AJ39=0,\"\",Zuschlag!AJ39))","v":""},{"$f":"IF(AJ$48=Daten!$A$146,\"\",IF(Zuschlag!AK39=0,\"\",Zuschlag!AK39))","v":""},{"$f":"IF(AK$48=Daten!$A$146,\"\",IF(Zuschlag!AL39=0,\"\",Zuschlag!AL39))","v":""},{"$f":"IF(AL$48=Daten!$A$146,\"\",IF(Zuschlag!AM39=0,\"\",Zuschlag!AM39))","v":""},{"$f":"IF(AM$48=Daten!$A$146,\"\",IF(Zuschlag!AN39=0,\"\",Zuschlag!AN39))","v":""},{"$f":"IF(AN$48=Daten!$A$146,\"\",IF(Zuschlag!AO39=0,\"\",Zuschlag!AO39))","v":""},{"$f":"IF(AO$48=Daten!$A$146,\"\",IF(Zuschlag!AP39=0,\"\",Zuschlag!AP39))","v":""},{"$f":"IF(AP$48=Daten!$A$146,\"\",IF(Zuschlag!AQ39=0,\"\",Zuschlag!AQ39))","v":""},{"$f":"IF(AQ$48=Daten!$A$146,\"\",IF(Zuschlag!AR39=0,\"\",Zuschlag!AR39))","v":""}]
[{"$f":"Zuschlag!A40","v":"4.2"},{"$f":"Zuschlag!B40","v":0},"","",{"$f":"IF(E$48=Daten!$A$146,\"\",IF(Zuschlag!F40=0,\"\",Zuschlag!F40))","v":""},{"$f":"IF(F$48=Daten!$A$146,\"\",IF(Zuschlag!G40=0,\"\",Zuschlag!G40))","v":""},{"$f":"IF(G$48=Daten!$A$146,\"\",IF(Zuschlag!H40=0,\"\",Zuschlag!H40))","v":""},{"$f":"IF(H$48=Daten!$A$146,\"\",IF(Zuschlag!I40=0,\"\",Zuschlag!I40))","v":""},{"$f":"IF(I$48=Daten!$A$146,\"\",IF(Zuschlag!J40=0,\"\",Zuschlag!J40))","v":""},{"$f":"IF(J$48=Daten!$A$146,\"\",IF(Zuschlag!K40=0,\"\",Zuschlag!K40))","v":""},{"$f":"IF(K$48=Daten!$A$146,\"\",IF(Zuschlag!L40=0,\"\",Zuschlag!L40))","v":""},{"$f":"IF(L$48=Daten!$A$146,\"\",IF(Zuschlag!M40=0,\"\",Zuschlag!M40))","v":""},{"$f":"IF(M$48=Daten!$A$146,\"\",IF(Zuschlag!N40=0,\"\",Zuschlag!N40))","v":""},{"$f":"IF(N$48=Daten!$A$146,\"\",IF(Zuschlag!O40=0,\"\",Zuschlag!O40))","v":""},{"$f":"IF(O$48=Daten!$A$146,\"\",IF(Zuschlag!P40=0,\"\",Zuschlag!P40))","v":""},{"$f":"IF(P$48=Daten!$A$146,\"\",IF(Zuschlag!Q40=0,\"\",Zuschlag!Q40))","v":""},{"$f":"IF(Q$48=Daten!$A$146,\"\",IF(Zuschlag!R40=0,\"\",Zuschlag!R40))","v":""},{"$f":"IF(R$48=Daten!$A$146,\"\",IF(Zuschlag!S40=0,\"\",Zuschlag!S40))","v":""},{"$f":"IF(S$48=Daten!$A$146,\"\",IF(Zuschlag!T40=0,\"\",Zuschlag!T40))","v":""},{"$f":"IF(T$48=Daten!$A$146,\"\",IF(Zuschlag!U40=0,\"\",Zuschlag!U40))","v":""},{"$f":"IF(U$48=Daten!$A$146,\"\",IF(Zuschlag!V40=0,\"\",Zuschlag!V40))","v":""},{"$f":"IF(V$48=Daten!$A$146,\"\",IF(Zuschlag!W40=0,\"\",Zuschlag!W40))","v":""},{"$f":"IF(W$48=Daten!$A$146,\"\",IF(Zuschlag!X40=0,\"\",Zuschlag!X40))","v":""},{"$f":"IF(X$48=Daten!$A$146,\"\",IF(Zuschlag!Y40=0,\"\",Zuschlag!Y40))","v":""},{"$f":"IF(Y$48=Daten!$A$146,\"\",IF(Zuschlag!Z40=0,\"\",Zuschlag!Z40))","v":""},{"$f":"IF(Z$48=Daten!$A$146,\"\",IF(Zuschlag!AA40=0,\"\",Zuschlag!AA40))","v":""},{"$f":"IF(AA$48=Daten!$A$146,\"\",IF(Zuschlag!AB40=0,\"\",Zuschlag!AB40))","v":""},{"$f":"IF(AB$48=Daten!$A$146,\"\",IF(Zuschlag!AC40=0,\"\",Zuschlag!AC40))","v":""},{"$f":"IF(AC$48=Daten!$A$146,\"\",IF(Zuschlag!AD40=0,\"\",Zuschlag!AD40))","v":""},{"$f":"IF(AD$48=Daten!$A$146,\"\",IF(Zuschlag!AE40=0,\"\",Zuschlag!AE40))","v":""},{"$f":"IF(AE$48=Daten!$A$146,\"\",IF(Zuschlag!AF40=0,\"\",Zuschlag!AF40))","v":""},{"$f":"IF(AF$48=Daten!$A$146,\"\",IF(Zuschlag!AG40=0,\"\",Zuschlag!AG40))","v":""},{"$f":"IF(AG$48=Daten!$A$146,\"\",IF(Zuschlag!AH40=0,\"\",Zuschlag!AH40))","v":""},{"$f":"IF(AH$48=Daten!$A$146,\"\",IF(Zuschlag!AI40=0,\"\",Zuschlag!AI40))","v":""},{"$f":"IF(AI$48=Daten!$A$146,\"\",IF(Zuschlag!AJ40=0,\"\",Zuschlag!AJ40))","v":""},{"$f":"IF(AJ$48=Daten!$A$146,\"\",IF(Zuschlag!AK40=0,\"\",Zuschlag!AK40))","v":""},{"$f":"IF(AK$48=Daten!$A$146,\"\",IF(Zuschlag!AL40=0,\"\",Zuschlag!AL40))","v":""},{"$f":"IF(AL$48=Daten!$A$146,\"\",IF(Zuschlag!AM40=0,\"\",Zuschlag!AM40))","v":""},{"$f":"IF(AM$48=Daten!$A$146,\"\",IF(Zuschlag!AN40=0,\"\",Zuschlag!AN40))","v":""},{"$f":"IF(AN$48=Daten!$A$146,\"\",IF(Zuschlag!AO40=0,\"\",Zuschlag!AO40))","v":""},{"$f":"IF(AO$48=Daten!$A$146,\"\",IF(Zuschlag!AP40=0,\"\",Zuschlag!AP40))","v":""},{"$f":"IF(AP$48=Daten!$A$146,\"\",IF(Zuschlag!AQ40=0,\"\",Zuschlag!AQ40))","v":""},{"$f":"IF(AQ$48=Daten!$A$146,\"\",IF(Zuschlag!AR40=0,\"\",Zuschlag!AR40))","v":""}]
[{"$f":"Zuschlag!A41","v":"4.3"},{"$f":"Zuschlag!B41","v":0},"","",{"$f":"IF(E$48=Daten!$A$146,\"\",IF(Zuschlag!F41=0,\"\",Zuschlag!F41))","v":""},{"$f":"IF(F$48=Daten!$A$146,\"\",IF(Zuschlag!G41=0,\"\",Zuschlag!G41))","v":""},{"$f":"IF(G$48=Daten!$A$146,\"\",IF(Zuschlag!H41=0,\"\",Zuschlag!H41))","v":""},{"$f":"IF(H$48=Daten!$A$146,\"\",IF(Zuschlag!I41=0,\"\",Zuschlag!I41))","v":""},{"$f":"IF(I$48=Daten!$A$146,\"\",IF(Zuschlag!J41=0,\"\",Zuschlag!J41))","v":""},{"$f":"IF(J$48=Daten!$A$146,\"\",IF(Zuschlag!K41=0,\"\",Zuschlag!K41))","v":""},{"$f":"IF(K$48=Daten!$A$146,\"\",IF(Zuschlag!L41=0,\"\",Zuschlag!L41))","v":""},{"$f":"IF(L$48=Daten!$A$146,\"\",IF(Zuschlag!M41=0,\"\",Zuschlag!M41))","v":""},{"$f":"IF(M$48=Daten!$A$146,\"\",IF(Zuschlag!N41=0,\"\",Zuschlag!N41))","v":""},{"$f":"IF(N$48=Daten!$A$146,\"\",IF(Zuschlag!O41=0,\"\",Zuschlag!O41))","v":""},{"$f":"IF(O$48=Daten!$A$146,\"\",IF(Zuschlag!P41=0,\"\",Zuschlag!P41))","v":""},{"$f":"IF(P$48=Daten!$A$146,\"\",IF(Zuschlag!Q41=0,\"\",Zuschlag!Q41))","v":""},{"$f":"IF(Q$48=Daten!$A$146,\"\",IF(Zuschlag!R41=0,\"\",Zuschlag!R41))","v":""},{"$f":"IF(R$48=Daten!$A$146,\"\",IF(Zuschlag!S41=0,\"\",Zuschlag!S41))","v":""},{"$f":"IF(S$48=Daten!$A$146,\"\",IF(Zuschlag!T41=0,\"\",Zuschlag!T41))","v":""},{"$f":"IF(T$48=Daten!$A$146,\"\",IF(Zuschlag!U41=0,\"\",Zuschlag!U41))","v":""},{"$f":"IF(U$48=Daten!$A$146,\"\",IF(Zuschlag!V41=0,\"\",Zuschlag!V41))","v":""},{"$f":"IF(V$48=Daten!$A$146,\"\",IF(Zuschlag!W41=0,\"\",Zuschlag!W41))","v":""},{"$f":"IF(W$48=Daten!$A$146,\"\",IF(Zuschlag!X41=0,\"\",Zuschlag!X41))","v":""},{"$f":"IF(X$48=Daten!$A$146,\"\",IF(Zuschlag!Y41=0,\"\",Zuschlag!Y41))","v":""},{"$f":"IF(Y$48=Daten!$A$146,\"\",IF(Zuschlag!Z41=0,\"\",Zuschlag!Z41))","v":""},{"$f":"IF(Z$48=Daten!$A$146,\"\",IF(Zuschlag!AA41=0,\"\",Zuschlag!AA41))","v":""},{"$f":"IF(AA$48=Daten!$A$146,\"\",IF(Zuschlag!AB41=0,\"\",Zuschlag!AB41))","v":""},{"$f":"IF(AB$48=Daten!$A$146,\"\",IF(Zuschlag!AC41=0,\"\",Zuschlag!AC41))","v":""},{"$f":"IF(AC$48=Daten!$A$146,\"\",IF(Zuschlag!AD41=0,\"\",Zuschlag!AD41))","v":""},{"$f":"IF(AD$48=Daten!$A$146,\"\",IF(Zuschlag!AE41=0,\"\",Zuschlag!AE41))","v":""},{"$f":"IF(AE$48=Daten!$A$146,\"\",IF(Zuschlag!AF41=0,\"\",Zuschlag!AF41))","v":""},{"$f":"IF(AF$48=Daten!$A$146,\"\",IF(Zuschlag!AG41=0,\"\",Zuschlag!AG41))","v":""},{"$f":"IF(AG$48=Daten!$A$146,\"\",IF(Zuschlag!AH41=0,\"\",Zuschlag!AH41))","v":""},{"$f":"IF(AH$48=Daten!$A$146,\"\",IF(Zuschlag!AI41=0,\"\",Zuschlag!AI41))","v":""},{"$f":"IF(AI$48=Daten!$A$146,\"\",IF(Zuschlag!AJ41=0,\"\",Zuschlag!AJ41))","v":""},{"$f":"IF(AJ$48=Daten!$A$146,\"\",IF(Zuschlag!AK41=0,\"\",Zuschlag!AK41))","v":""},{"$f":"IF(AK$48=Daten!$A$146,\"\",IF(Zuschlag!AL41=0,\"\",Zuschlag!AL41))","v":""},{"$f":"IF(AL$48=Daten!$A$146,\"\",IF(Zuschlag!AM41=0,\"\",Zuschlag!AM41))","v":""},{"$f":"IF(AM$48=Daten!$A$146,\"\",IF(Zuschlag!AN41=0,\"\",Zuschlag!AN41))","v":""},{"$f":"IF(AN$48=Daten!$A$146,\"\",IF(Zuschlag!AO41=0,\"\",Zuschlag!AO41))","v":""},{"$f":"IF(AO$48=Daten!$A$146,\"\",IF(Zuschlag!AP41=0,\"\",Zuschlag!AP41))","v":""},{"$f":"IF(AP$48=Daten!$A$146,\"\",IF(Zuschlag!AQ41=0,\"\",Zuschlag!AQ41))","v":""},{"$f":"IF(AQ$48=Daten!$A$146,\"\",IF(Zuschlag!AR41=0,\"\",Zuschlag!AR41))","v":""}]
[{"$f":"Zuschlag!A42","v":"4.4"},{"$f":"Zuschlag!B42","v":0},"","",{"$f":"IF(E$48=Daten!$A$146,\"\",IF(Zuschlag!F42=0,\"\",Zuschlag!F42))","v":""},{"$f":"IF(F$48=Daten!$A$146,\"\",IF(Zuschlag!G42=0,\"\",Zuschlag!G42))","v":""},{"$f":"IF(G$48=Daten!$A$146,\"\",IF(Zuschlag!H42=0,\"\",Zuschlag!H42))","v":""},{"$f":"IF(H$48=Daten!$A$146,\"\",IF(Zuschlag!I42=0,\"\",Zuschlag!I42))","v":""},{"$f":"IF(I$48=Daten!$A$146,\"\",IF(Zuschlag!J42=0,\"\",Zuschlag!J42))","v":""},{"$f":"IF(J$48=Daten!$A$146,\"\",IF(Zuschlag!K42=0,\"\",Zuschlag!K42))","v":""},{"$f":"IF(K$48=Daten!$A$146,\"\",IF(Zuschlag!L42=0,\"\",Zuschlag!L42))","v":""},{"$f":"IF(L$48=Daten!$A$146,\"\",IF(Zuschlag!M42=0,\"\",Zuschlag!M42))","v":""},{"$f":"IF(M$48=Daten!$A$146,\"\",IF(Zuschlag!N42=0,\"\",Zuschlag!N42))","v":""},{"$f":"IF(N$48=Daten!$A$146,\"\",IF(Zuschlag!O42=0,\"\",Zuschlag!O42))","v":""},{"$f":"IF(O$48=Daten!$A$146,\"\",IF(Zuschlag!P42=0,\"\",Zuschlag!P42))","v":""},{"$f":"IF(P$48=Daten!$A$146,\"\",IF(Zuschlag!Q42=0,\"\",Zuschlag!Q42))","v":""},{"$f":"IF(Q$48=Daten!$A$146,\"\",IF(Zuschlag!R42=0,\"\",Zuschlag!R42))","v":""},{"$f":"IF(R$48=Daten!$A$146,\"\",IF(Zuschlag!S42=0,\"\",Zuschlag!S42))","v":""},{"$f":"IF(S$48=Daten!$A$146,\"\",IF(Zuschlag!T42=0,\"\",Zuschlag!T42))","v":""},{"$f":"IF(T$48=Daten!$A$146,\"\",IF(Zuschlag!U42=0,\"\",Zuschlag!U42))","v":""},{"$f":"IF(U$48=Daten!$A$146,\"\",IF(Zuschlag!V42=0,\"\",Zuschlag!V42))","v":""},{"$f":"IF(V$48=Daten!$A$146,\"\",IF(Zuschlag!W42=0,\"\",Zuschlag!W42))","v":""},{"$f":"IF(W$48=Daten!$A$146,\"\",IF(Zuschlag!X42=0,\"\",Zuschlag!X42))","v":""},{"$f":"IF(X$48=Daten!$A$146,\"\",IF(Zuschlag!Y42=0,\"\",Zuschlag!Y42))","v":""},{"$f":"IF(Y$48=Daten!$A$146,\"\",IF(Zuschlag!Z42=0,\"\",Zuschlag!Z42))","v":""},{"$f":"IF(Z$48=Daten!$A$146,\"\",IF(Zuschlag!AA42=0,\"\",Zuschlag!AA42))","v":""},{"$f":"IF(AA$48=Daten!$A$146,\"\",IF(Zuschlag!AB42=0,\"\",Zuschlag!AB42))","v":""},{"$f":"IF(AB$48=Daten!$A$146,\"\",IF(Zuschlag!AC42=0,\"\",Zuschlag!AC42))","v":""},{"$f":"IF(AC$48=Daten!$A$146,\"\",IF(Zuschlag!AD42=0,\"\",Zuschlag!AD42))","v":""},{"$f":"IF(AD$48=Daten!$A$146,\"\",IF(Zuschlag!AE42=0,\"\",Zuschlag!AE42))","v":""},{"$f":"IF(AE$48=Daten!$A$146,\"\",IF(Zuschlag!AF42=0,\"\",Zuschlag!AF42))","v":""},{"$f":"IF(AF$48=Daten!$A$146,\"\",IF(Zuschlag!AG42=0,\"\",Zuschlag!AG42))","v":""},{"$f":"IF(AG$48=Daten!$A$146,\"\",IF(Zuschlag!AH42=0,\"\",Zuschlag!AH42))","v":""},{"$f":"IF(AH$48=Daten!$A$146,\"\",IF(Zuschlag!AI42=0,\"\",Zuschlag!AI42))","v":""},{"$f":"IF(AI$48=Daten!$A$146,\"\",IF(Zuschlag!AJ42=0,\"\",Zuschlag!AJ42))","v":""},{"$f":"IF(AJ$48=Daten!$A$146,\"\",IF(Zuschlag!AK42=0,\"\",Zuschlag!AK42))","v":""},{"$f":"IF(AK$48=Daten!$A$146,\"\",IF(Zuschlag!AL42=0,\"\",Zuschlag!AL42))","v":""},{"$f":"IF(AL$48=Daten!$A$146,\"\",IF(Zuschlag!AM42=0,\"\",Zuschlag!AM42))","v":""},{"$f":"IF(AM$48=Daten!$A$146,\"\",IF(Zuschlag!AN42=0,\"\",Zuschlag!AN42))","v":""},{"$f":"IF(AN$48=Daten!$A$146,\"\",IF(Zuschlag!AO42=0,\"\",Zuschlag!AO42))","v":""},{"$f":"IF(AO$48=Daten!$A$146,\"\",IF(Zuschlag!AP42=0,\"\",Zuschlag!AP42))","v":""},{"$f":"IF(AP$48=Daten!$A$146,\"\",IF(Zuschlag!AQ42=0,\"\",Zuschlag!AQ42))","v":""},{"$f":"IF(AQ$48=Daten!$A$146,\"\",IF(Zuschlag!AR42=0,\"\",Zuschlag!AR42))","v":""}]
[{"$f":"Zuschlag!A43","v":0},{"$f":"Zuschlag!B43","v":0},"","",{"$f":"IF(E$48=Daten!$A$146,\"\",IF(Zuschlag!F43=0,\"\",Zuschlag!F43))","v":""},{"$f":"IF(F$48=Daten!$A$146,\"\",IF(Zuschlag!G43=0,\"\",Zuschlag!G43))","v":""},{"$f":"IF(G$48=Daten!$A$146,\"\",IF(Zuschlag!H43=0,\"\",Zuschlag!H43))","v":""},{"$f":"IF(H$48=Daten!$A$146,\"\",IF(Zuschlag!I43=0,\"\",Zuschlag!I43))","v":""},{"$f":"IF(I$48=Daten!$A$146,\"\",IF(Zuschlag!J43=0,\"\",Zuschlag!J43))","v":""},{"$f":"IF(J$48=Daten!$A$146,\"\",IF(Zuschlag!K43=0,\"\",Zuschlag!K43))","v":""},{"$f":"IF(K$48=Daten!$A$146,\"\",IF(Zuschlag!L43=0,\"\",Zuschlag!L43))","v":""},{"$f":"IF(L$48=Daten!$A$146,\"\",IF(Zuschlag!M43=0,\"\",Zuschlag!M43))","v":""},{"$f":"IF(M$48=Daten!$A$146,\"\",IF(Zuschlag!N43=0,\"\",Zuschlag!N43))","v":""},{"$f":"IF(N$48=Daten!$A$146,\"\",IF(Zuschlag!O43=0,\"\",Zuschlag!O43))","v":""},{"$f":"IF(O$48=Daten!$A$146,\"\",IF(Zuschlag!P43=0,\"\",Zuschlag!P43))","v":""},{"$f":"IF(P$48=Daten!$A$146,\"\",IF(Zuschlag!Q43=0,\"\",Zuschlag!Q43))","v":""},{"$f":"IF(Q$48=Daten!$A$146,\"\",IF(Zuschlag!R43=0,\"\",Zuschlag!R43))","v":""},{"$f":"IF(R$48=Daten!$A$146,\"\",IF(Zuschlag!S43=0,\"\",Zuschlag!S43))","v":""},{"$f":"IF(S$48=Daten!$A$146,\"\",IF(Zuschlag!T43=0,\"\",Zuschlag!T43))","v":""},{"$f":"IF(T$48=Daten!$A$146,\"\",IF(Zuschlag!U43=0,\"\",Zuschlag!U43))","v":""},{"$f":"IF(U$48=Daten!$A$146,\"\",IF(Zuschlag!V43=0,\"\",Zuschlag!V43))","v":""},{"$f":"IF(V$48=Daten!$A$146,\"\",IF(Zuschlag!W43=0,\"\",Zuschlag!W43))","v":""},{"$f":"IF(W$48=Daten!$A$146,\"\",IF(Zuschlag!X43=0,\"\",Zuschlag!X43))","v":""},{"$f":"IF(X$48=Daten!$A$146,\"\",IF(Zuschlag!Y43=0,\"\",Zuschlag!Y43))","v":""},{"$f":"IF(Y$48=Daten!$A$146,\"\",IF(Zuschlag!Z43=0,\"\",Zuschlag!Z43))","v":""},{"$f":"IF(Z$48=Daten!$A$146,\"\",IF(Zuschlag!AA43=0,\"\",Zuschlag!AA43))","v":""},{"$f":"IF(AA$48=Daten!$A$146,\"\",IF(Zuschlag!AB43=0,\"\",Zuschlag!AB43))","v":""},{"$f":"IF(AB$48=Daten!$A$146,\"\",IF(Zuschlag!AC43=0,\"\",Zuschlag!AC43))","v":""},{"$f":"IF(AC$48=Daten!$A$146,\"\",IF(Zuschlag!AD43=0,\"\",Zuschlag!AD43))","v":""},{"$f":"IF(AD$48=Daten!$A$146,\"\",IF(Zuschlag!AE43=0,\"\",Zuschlag!AE43))","v":""},{"$f":"IF(AE$48=Daten!$A$146,\"\",IF(Zuschlag!AF43=0,\"\",Zuschlag!AF43))","v":""},{"$f":"IF(AF$48=Daten!$A$146,\"\",IF(Zuschlag!AG43=0,\"\",Zuschlag!AG43))","v":""},{"$f":"IF(AG$48=Daten!$A$146,\"\",IF(Zuschlag!AH43=0,\"\",Zuschlag!AH43))","v":""},{"$f":"IF(AH$48=Daten!$A$146,\"\",IF(Zuschlag!AI43=0,\"\",Zuschlag!AI43))","v":""},{"$f":"IF(AI$48=Daten!$A$146,\"\",IF(Zuschlag!AJ43=0,\"\",Zuschlag!AJ43))","v":""},{"$f":"IF(AJ$48=Daten!$A$146,\"\",IF(Zuschlag!AK43=0,\"\",Zuschlag!AK43))","v":""},{"$f":"IF(AK$48=Daten!$A$146,\"\",IF(Zuschlag!AL43=0,\"\",Zuschlag!AL43))","v":""},{"$f":"IF(AL$48=Daten!$A$146,\"\",IF(Zuschlag!AM43=0,\"\",Zuschlag!AM43))","v":""},{"$f":"IF(AM$48=Daten!$A$146,\"\",IF(Zuschlag!AN43=0,\"\",Zuschlag!AN43))","v":""},{"$f":"IF(AN$48=Daten!$A$146,\"\",IF(Zuschlag!AO43=0,\"\",Zuschlag!AO43))","v":""},{"$f":"IF(AO$48=Daten!$A$146,\"\",IF(Zuschlag!AP43=0,\"\",Zuschlag!AP43))","v":""},{"$f":"IF(AP$48=Daten!$A$146,\"\",IF(Zuschlag!AQ43=0,\"\",Zuschlag!AQ43))","v":""},{"$f":"IF(AQ$48=Daten!$A$146,\"\",IF(Zuschlag!AR43=0,\"\",Zuschlag!AR43))","v":""}]
[{"$f":"Zuschlag!A44","v":"5"},{"$f":"Zuschlag!B44","v":0},"","",{"$f":"IF(E$48=Daten!$A$146,\"\",IF(Zuschlag!F44=0,\"\",Zuschlag!F44))","v":""},{"$f":"IF(F$48=Daten!$A$146,\"\",IF(Zuschlag!G44=0,\"\",Zuschlag!G44))","v":""},{"$f":"IF(G$48=Daten!$A$146,\"\",IF(Zuschlag!H44=0,\"\",Zuschlag!H44))","v":""},{"$f":"IF(H$48=Daten!$A$146,\"\",IF(Zuschlag!I44=0,\"\",Zuschlag!I44))","v":""},{"$f":"IF(I$48=Daten!$A$146,\"\",IF(Zuschlag!J44=0,\"\",Zuschlag!J44))","v":""},{"$f":"IF(J$48=Daten!$A$146,\"\",IF(Zuschlag!K44=0,\"\",Zuschlag!K44))","v":""},{"$f":"IF(K$48=Daten!$A$146,\"\",IF(Zuschlag!L44=0,\"\",Zuschlag!L44))","v":""},{"$f":"IF(L$48=Daten!$A$146,\"\",IF(Zuschlag!M44=0,\"\",Zuschlag!M44))","v":""},{"$f":"IF(M$48=Daten!$A$146,\"\",IF(Zuschlag!N44=0,\"\",Zuschlag!N44))","v":""},{"$f":"IF(N$48=Daten!$A$146,\"\",IF(Zuschlag!O44=0,\"\",Zuschlag!O44))","v":""},{"$f":"IF(O$48=Daten!$A$146,\"\",IF(Zuschlag!P44=0,\"\",Zuschlag!P44))","v":""},{"$f":"IF(P$48=Daten!$A$146,\"\",IF(Zuschlag!Q44=0,\"\",Zuschlag!Q44))","v":""},{"$f":"IF(Q$48=Daten!$A$146,\"\",IF(Zuschlag!R44=0,\"\",Zuschlag!R44))","v":""},{"$f":"IF(R$48=Daten!$A$146,\"\",IF(Zuschlag!S44=0,\"\",Zuschlag!S44))","v":""},{"$f":"IF(S$48=Daten!$A$146,\"\",IF(Zuschlag!T44=0,\"\",Zuschlag!T44))","v":""},{"$f":"IF(T$48=Daten!$A$146,\"\",IF(Zuschlag!U44=0,\"\",Zuschlag!U44))","v":""},{"$f":"IF(U$48=Daten!$A$146,\"\",IF(Zuschlag!V44=0,\"\",Zuschlag!V44))","v":""},{"$f":"IF(V$48=Daten!$A$146,\"\",IF(Zuschlag!W44=0,\"\",Zuschlag!W44))","v":""},{"$f":"IF(W$48=Daten!$A$146,\"\",IF(Zuschlag!X44=0,\"\",Zuschlag!X44))","v":""},{"$f":"IF(X$48=Daten!$A$146,\"\",IF(Zuschlag!Y44=0,\"\",Zuschlag!Y44))","v":""},{"$f":"IF(Y$48=Daten!$A$146,\"\",IF(Zuschlag!Z44=0,\"\",Zuschlag!Z44))","v":""},{"$f":"IF(Z$48=Daten!$A$146,\"\",IF(Zuschlag!AA44=0,\"\",Zuschlag!AA44))","v":""},{"$f":"IF(AA$48=Daten!$A$146,\"\",IF(Zuschlag!AB44=0,\"\",Zuschlag!AB44))","v":""},{"$f":"IF(AB$48=Daten!$A$146,\"\",IF(Zuschlag!AC44=0,\"\",Zuschlag!AC44))","v":""},{"$f":"IF(AC$48=Daten!$A$146,\"\",IF(Zuschlag!AD44=0,\"\",Zuschlag!AD44))","v":""},{"$f":"IF(AD$48=Daten!$A$146,\"\",IF(Zuschlag!AE44=0,\"\",Zuschlag!AE44))","v":""},{"$f":"IF(AE$48=Daten!$A$146,\"\",IF(Zuschlag!AF44=0,\"\",Zuschlag!AF44))","v":""},{"$f":"IF(AF$48=Daten!$A$146,\"\",IF(Zuschlag!AG44=0,\"\",Zuschlag!AG44))","v":""},{"$f":"IF(AG$48=Daten!$A$146,\"\",IF(Zuschlag!AH44=0,\"\",Zuschlag!AH44))","v":""},{"$f":"IF(AH$48=Daten!$A$146,\"\",IF(Zuschlag!AI44=0,\"\",Zuschlag!AI44))","v":""},{"$f":"IF(AI$48=Daten!$A$146,\"\",IF(Zuschlag!AJ44=0,\"\",Zuschlag!AJ44))","v":""},{"$f":"IF(AJ$48=Daten!$A$146,\"\",IF(Zuschlag!AK44=0,\"\",Zuschlag!AK44))","v":""},{"$f":"IF(AK$48=Daten!$A$146,\"\",IF(Zuschlag!AL44=0,\"\",Zuschlag!AL44))","v":""},{"$f":"IF(AL$48=Daten!$A$146,\"\",IF(Zuschlag!AM44=0,\"\",Zuschlag!AM44))","v":""},{"$f":"IF(AM$48=Daten!$A$146,\"\",IF(Zuschlag!AN44=0,\"\",Zuschlag!AN44))","v":""},{"$f":"IF(AN$48=Daten!$A$146,\"\",IF(Zuschlag!AO44=0,\"\",Zuschlag!AO44))","v":""},{"$f":"IF(AO$48=Daten!$A$146,\"\",IF(Zuschlag!AP44=0,\"\",Zuschlag!AP44))","v":""},{"$f":"IF(AP$48=Daten!$A$146,\"\",IF(Zuschlag!AQ44=0,\"\",Zuschlag!AQ44))","v":""},{"$f":"IF(AQ$48=Daten!$A$146,\"\",IF(Zuschlag!AR44=0,\"\",Zuschlag!AR44))","v":""}]
[{"$f":"Zuschlag!A45","v":0},{"$f":"Zuschlag!B45","v":0},"","",{"$f":"IF(E$48=Daten!$A$146,\"\",IF(Zuschlag!F45=0,\"\",Zuschlag!F45))","v":""},{"$f":"IF(F$48=Daten!$A$146,\"\",IF(Zuschlag!G45=0,\"\",Zuschlag!G45))","v":""},{"$f":"IF(G$48=Daten!$A$146,\"\",IF(Zuschlag!H45=0,\"\",Zuschlag!H45))","v":""},{"$f":"IF(H$48=Daten!$A$146,\"\",IF(Zuschlag!I45=0,\"\",Zuschlag!I45))","v":""},{"$f":"IF(I$48=Daten!$A$146,\"\",IF(Zuschlag!J45=0,\"\",Zuschlag!J45))","v":""},{"$f":"IF(J$48=Daten!$A$146,\"\",IF(Zuschlag!K45=0,\"\",Zuschlag!K45))","v":""},{"$f":"IF(K$48=Daten!$A$146,\"\",IF(Zuschlag!L45=0,\"\",Zuschlag!L45))","v":""},{"$f":"IF(L$48=Daten!$A$146,\"\",IF(Zuschlag!M45=0,\"\",Zuschlag!M45))","v":""},{"$f":"IF(M$48=Daten!$A$146,\"\",IF(Zuschlag!N45=0,\"\",Zuschlag!N45))","v":""},{"$f":"IF(N$48=Daten!$A$146,\"\",IF(Zuschlag!O45=0,\"\",Zuschlag!O45))","v":""},{"$f":"IF(O$48=Daten!$A$146,\"\",IF(Zuschlag!P45=0,\"\",Zuschlag!P45))","v":""},{"$f":"IF(P$48=Daten!$A$146,\"\",IF(Zuschlag!Q45=0,\"\",Zuschlag!Q45))","v":""},{"$f":"IF(Q$48=Daten!$A$146,\"\",IF(Zuschlag!R45=0,\"\",Zuschlag!R45))","v":""},{"$f":"IF(R$48=Daten!$A$146,\"\",IF(Zuschlag!S45=0,\"\",Zuschlag!S45))","v":""},{"$f":"IF(S$48=Daten!$A$146,\"\",IF(Zuschlag!T45=0,\"\",Zuschlag!T45))","v":""},{"$f":"IF(T$48=Daten!$A$146,\"\",IF(Zuschlag!U45=0,\"\",Zuschlag!U45))","v":""},{"$f":"IF(U$48=Daten!$A$146,\"\",IF(Zuschlag!V45=0,\"\",Zuschlag!V45))","v":""},{"$f":"IF(V$48=Daten!$A$146,\"\",IF(Zuschlag!W45=0,\"\",Zuschlag!W45))","v":""},{"$f":"IF(W$48=Daten!$A$146,\"\",IF(Zuschlag!X45=0,\"\",Zuschlag!X45))","v":""},{"$f":"IF(X$48=Daten!$A$146,\"\",IF(Zuschlag!Y45=0,\"\",Zuschlag!Y45))","v":""},{"$f":"IF(Y$48=Daten!$A$146,\"\",IF(Zuschlag!Z45=0,\"\",Zuschlag!Z45))","v":""},{"$f":"IF(Z$48=Daten!$A$146,\"\",IF(Zuschlag!AA45=0,\"\",Zuschlag!AA45))","v":""},{"$f":"IF(AA$48=Daten!$A$146,\"\",IF(Zuschlag!AB45=0,\"\",Zuschlag!AB45))","v":""},{"$f":"IF(AB$48=Daten!$A$146,\"\",IF(Zuschlag!AC45=0,\"\",Zuschlag!AC45))","v":""},{"$f":"IF(AC$48=Daten!$A$146,\"\",IF(Zuschlag!AD45=0,\"\",Zuschlag!AD45))","v":""},{"$f":"IF(AD$48=Daten!$A$146,\"\",IF(Zuschlag!AE45=0,\"\",Zuschlag!AE45))","v":""},{"$f":"IF(AE$48=Daten!$A$146,\"\",IF(Zuschlag!AF45=0,\"\",Zuschlag!AF45))","v":""},{"$f":"IF(AF$48=Daten!$A$146,\"\",IF(Zuschlag!AG45=0,\"\",Zuschlag!AG45))","v":""},{"$f":"IF(AG$48=Daten!$A$146,\"\",IF(Zuschlag!AH45=0,\"\",Zuschlag!AH45))","v":""},{"$f":"IF(AH$48=Daten!$A$146,\"\",IF(Zuschlag!AI45=0,\"\",Zuschlag!AI45))","v":""},{"$f":"IF(AI$48=Daten!$A$146,\"\",IF(Zuschlag!AJ45=0,\"\",Zuschlag!AJ45))","v":""},{"$f":"IF(AJ$48=Daten!$A$146,\"\",IF(Zuschlag!AK45=0,\"\",Zuschlag!AK45))","v":""},{"$f":"IF(AK$48=Daten!$A$146,\"\",IF(Zuschlag!AL45=0,\"\",Zuschlag!AL45))","v":""},{"$f":"IF(AL$48=Daten!$A$146,\"\",IF(Zuschlag!AM45=0,\"\",Zuschlag!AM45))","v":""},{"$f":"IF(AM$48=Daten!$A$146,\"\",IF(Zuschlag!AN45=0,\"\",Zuschlag!AN45))","v":""},{"$f":"IF(AN$48=Daten!$A$146,\"\",IF(Zuschlag!AO45=0,\"\",Zuschlag!AO45))","v":""},{"$f":"IF(AO$48=Daten!$A$146,\"\",IF(Zuschlag!AP45=0,\"\",Zuschlag!AP45))","v":""},{"$f":"IF(AP$48=Daten!$A$146,\"\",IF(Zuschlag!AQ45=0,\"\",Zuschlag!AQ45))","v":""},{"$f":"IF(AQ$48=Daten!$A$146,\"\",IF(Zuschlag!AR45=0,\"\",Zuschlag!AR45))","v":""}]
[{"$f":"Zuschlag!A46","v":"5.1"},{"$f":"Zuschlag!B46","v":0},"","",{"$f":"IF(E$48=Daten!$A$146,\"\",IF(Zuschlag!F46=0,\"\",Zuschlag!F46))","v":""},{"$f":"IF(F$48=Daten!$A$146,\"\",IF(Zuschlag!G46=0,\"\",Zuschlag!G46))","v":""},{"$f":"IF(G$48=Daten!$A$146,\"\",IF(Zuschlag!H46=0,\"\",Zuschlag!H46))","v":""},{"$f":"IF(H$48=Daten!$A$146,\"\",IF(Zuschlag!I46=0,\"\",Zuschlag!I46))","v":""},{"$f":"IF(I$48=Daten!$A$146,\"\",IF(Zuschlag!J46=0,\"\",Zuschlag!J46))","v":""},{"$f":"IF(J$48=Daten!$A$146,\"\",IF(Zuschlag!K46=0,\"\",Zuschlag!K46))","v":""},{"$f":"IF(K$48=Daten!$A$146,\"\",IF(Zuschlag!L46=0,\"\",Zuschlag!L46))","v":""},{"$f":"IF(L$48=Daten!$A$146,\"\",IF(Zuschlag!M46=0,\"\",Zuschlag!M46))","v":""},{"$f":"IF(M$48=Daten!$A$146,\"\",IF(Zuschlag!N46=0,\"\",Zuschlag!N46))","v":""},{"$f":"IF(N$48=Daten!$A$146,\"\",IF(Zuschlag!O46=0,\"\",Zuschlag!O46))","v":""},{"$f":"IF(O$48=Daten!$A$146,\"\",IF(Zuschlag!P46=0,\"\",Zuschlag!P46))","v":""},{"$f":"IF(P$48=Daten!$A$146,\"\",IF(Zuschlag!Q46=0,\"\",Zuschlag!Q46))","v":""},{"$f":"IF(Q$48=Daten!$A$146,\"\",IF(Zuschlag!R46=0,\"\",Zuschlag!R46))","v":""},{"$f":"IF(R$48=Daten!$A$146,\"\",IF(Zuschlag!S46=0,\"\",Zuschlag!S46))","v":""},{"$f":"IF(S$48=Daten!$A$146,\"\",IF(Zuschlag!T46=0,\"\",Zuschlag!T46))","v":""},{"$f":"IF(T$48=Daten!$A$146,\"\",IF(Zuschlag!U46=0,\"\",Zuschlag!U46))","v":""},{"$f":"IF(U$48=Daten!$A$146,\"\",IF(Zuschlag!V46=0,\"\",Zuschlag!V46))","v":""},{"$f":"IF(V$48=Daten!$A$146,\"\",IF(Zuschlag!W46=0,\"\",Zuschlag!W46))","v":""},{"$f":"IF(W$48=Daten!$A$146,\"\",IF(Zuschlag!X46=0,\"\",Zuschlag!X46))","v":""},{"$f":"IF(X$48=Daten!$A$146,\"\",IF(Zuschlag!Y46=0,\"\",Zuschlag!Y46))","v":""},{"$f":"IF(Y$48=Daten!$A$146,\"\",IF(Zuschlag!Z46=0,\"\",Zuschlag!Z46))","v":""},{"$f":"IF(Z$48=Daten!$A$146,\"\",IF(Zuschlag!AA46=0,\"\",Zuschlag!AA46))","v":""},{"$f":"IF(AA$48=Daten!$A$146,\"\",IF(Zuschlag!AB46=0,\"\",Zuschlag!AB46))","v":""},{"$f":"IF(AB$48=Daten!$A$146,\"\",IF(Zuschlag!AC46=0,\"\",Zuschlag!AC46))","v":""},{"$f":"IF(AC$48=Daten!$A$146,\"\",IF(Zuschlag!AD46=0,\"\",Zuschlag!AD46))","v":""},{"$f":"IF(AD$48=Daten!$A$146,\"\",IF(Zuschlag!AE46=0,\"\",Zuschlag!AE46))","v":""},{"$f":"IF(AE$48=Daten!$A$146,\"\",IF(Zuschlag!AF46=0,\"\",Zuschlag!AF46))","v":""},{"$f":"IF(AF$48=Daten!$A$146,\"\",IF(Zuschlag!AG46=0,\"\",Zuschlag!AG46))","v":""},{"$f":"IF(AG$48=Daten!$A$146,\"\",IF(Zuschlag!AH46=0,\"\",Zuschlag!AH46))","v":""},{"$f":"IF(AH$48=Daten!$A$146,\"\",IF(Zuschlag!AI46=0,\"\",Zuschlag!AI46))","v":""},{"$f":"IF(AI$48=Daten!$A$146,\"\",IF(Zuschlag!AJ46=0,\"\",Zuschlag!AJ46))","v":""},{"$f":"IF(AJ$48=Daten!$A$146,\"\",IF(Zuschlag!AK46=0,\"\",Zuschlag!AK46))","v":""},{"$f":"IF(AK$48=Daten!$A$146,\"\",IF(Zuschlag!AL46=0,\"\",Zuschlag!AL46))","v":""},{"$f":"IF(AL$48=Daten!$A$146,\"\",IF(Zuschlag!AM46=0,\"\",Zuschlag!AM46))","v":""},{"$f":"IF(AM$48=Daten!$A$146,\"\",IF(Zuschlag!AN46=0,\"\",Zuschlag!AN46))","v":""},{"$f":"IF(AN$48=Daten!$A$146,\"\",IF(Zuschlag!AO46=0,\"\",Zuschlag!AO46))","v":""},{"$f":"IF(AO$48=Daten!$A$146,\"\",IF(Zuschlag!AP46=0,\"\",Zuschlag!AP46))","v":""},{"$f":"IF(AP$48=Daten!$A$146,\"\",IF(Zuschlag!AQ46=0,\"\",Zuschlag!AQ46))","v":""},{"$f":"IF(AQ$48=Daten!$A$146,\"\",IF(Zuschlag!AR46=0,\"\",Zuschlag!AR46))","v":""}]
[{"$f":"Zuschlag!A47","v":"5.2"},{"$f":"Zuschlag!B47","v":0},"","",{"$f":"IF(E$48=Daten!$A$146,\"\",IF(Zuschlag!F47=0,\"\",Zuschlag!F47))","v":""},{"$f":"IF(F$48=Daten!$A$146,\"\",IF(Zuschlag!G47=0,\"\",Zuschlag!G47))","v":""},{"$f":"IF(G$48=Daten!$A$146,\"\",IF(Zuschlag!H47=0,\"\",Zuschlag!H47))","v":""},{"$f":"IF(H$48=Daten!$A$146,\"\",IF(Zuschlag!I47=0,\"\",Zuschlag!I47))","v":""},{"$f":"IF(I$48=Daten!$A$146,\"\",IF(Zuschlag!J47=0,\"\",Zuschlag!J47))","v":""},{"$f":"IF(J$48=Daten!$A$146,\"\",IF(Zuschlag!K47=0,\"\",Zuschlag!K47))","v":""},{"$f":"IF(K$48=Daten!$A$146,\"\",IF(Zuschlag!L47=0,\"\",Zuschlag!L47))","v":""},{"$f":"IF(L$48=Daten!$A$146,\"\",IF(Zuschlag!M47=0,\"\",Zuschlag!M47))","v":""},{"$f":"IF(M$48=Daten!$A$146,\"\",IF(Zuschlag!N47=0,\"\",Zuschlag!N47))","v":""},{"$f":"IF(N$48=Daten!$A$146,\"\",IF(Zuschlag!O47=0,\"\",Zuschlag!O47))","v":""},{"$f":"IF(O$48=Daten!$A$146,\"\",IF(Zuschlag!P47=0,\"\",Zuschlag!P47))","v":""},{"$f":"IF(P$48=Daten!$A$146,\"\",IF(Zuschlag!Q47=0,\"\",Zuschlag!Q47))","v":""},{"$f":"IF(Q$48=Daten!$A$146,\"\",IF(Zuschlag!R47=0,\"\",Zuschlag!R47))","v":""},{"$f":"IF(R$48=Daten!$A$146,\"\",IF(Zuschlag!S47=0,\"\",Zuschlag!S47))","v":""},{"$f":"IF(S$48=Daten!$A$146,\"\",IF(Zuschlag!T47=0,\"\",Zuschlag!T47))","v":""},{"$f":"IF(T$48=Daten!$A$146,\"\",IF(Zuschlag!U47=0,\"\",Zuschlag!U47))","v":""},{"$f":"IF(U$48=Daten!$A$146,\"\",IF(Zuschlag!V47=0,\"\",Zuschlag!V47))","v":""},{"$f":"IF(V$48=Daten!$A$146,\"\",IF(Zuschlag!W47=0,\"\",Zuschlag!W47))","v":""},{"$f":"IF(W$48=Daten!$A$146,\"\",IF(Zuschlag!X47=0,\"\",Zuschlag!X47))","v":""},{"$f":"IF(X$48=Daten!$A$146,\"\",IF(Zuschlag!Y47=0,\"\",Zuschlag!Y47))","v":""},{"$f":"IF(Y$48=Daten!$A$146,\"\",IF(Zuschlag!Z47=0,\"\",Zuschlag!Z47))","v":""},{"$f":"IF(Z$48=Daten!$A$146,\"\",IF(Zuschlag!AA47=0,\"\",Zuschlag!AA47))","v":""},{"$f":"IF(AA$48=Daten!$A$146,\"\",IF(Zuschlag!AB47=0,\"\",Zuschlag!AB47))","v":""},{"$f":"IF(AB$48=Daten!$A$146,\"\",IF(Zuschlag!AC47=0,\"\",Zuschlag!AC47))","v":""},{"$f":"IF(AC$48=Daten!$A$146,\"\",IF(Zuschlag!AD47=0,\"\",Zuschlag!AD47))","v":""},{"$f":"IF(AD$48=Daten!$A$146,\"\",IF(Zuschlag!AE47=0,\"\",Zuschlag!AE47))","v":""},{"$f":"IF(AE$48=Daten!$A$146,\"\",IF(Zuschlag!AF47=0,\"\",Zuschlag!AF47))","v":""},{"$f":"IF(AF$48=Daten!$A$146,\"\",IF(Zuschlag!AG47=0,\"\",Zuschlag!AG47))","v":""},{"$f":"IF(AG$48=Daten!$A$146,\"\",IF(Zuschlag!AH47=0,\"\",Zuschlag!AH47))","v":""},{"$f":"IF(AH$48=Daten!$A$146,\"\",IF(Zuschlag!AI47=0,\"\",Zuschlag!AI47))","v":""},{"$f":"IF(AI$48=Daten!$A$146,\"\",IF(Zuschlag!AJ47=0,\"\",Zuschlag!AJ47))","v":""},{"$f":"IF(AJ$48=Daten!$A$146,\"\",IF(Zuschlag!AK47=0,\"\",Zuschlag!AK47))","v":""},{"$f":"IF(AK$48=Daten!$A$146,\"\",IF(Zuschlag!AL47=0,\"\",Zuschlag!AL47))","v":""},{"$f":"IF(AL$48=Daten!$A$146,\"\",IF(Zuschlag!AM47=0,\"\",Zuschlag!AM47))","v":""},{"$f":"IF(AM$48=Daten!$A$146,\"\",IF(Zuschlag!AN47=0,\"\",Zuschlag!AN47))","v":""},{"$f":"IF(AN$48=Daten!$A$146,\"\",IF(Zuschlag!AO47=0,\"\",Zuschlag!AO47))","v":""},{"$f":"IF(AO$48=Daten!$A$146,\"\",IF(Zuschlag!AP47=0,\"\",Zuschlag!AP47))","v":""},{"$f":"IF(AP$48=Daten!$A$146,\"\",IF(Zuschlag!AQ47=0,\"\",Zuschlag!AQ47))","v":""},{"$f":"IF(AQ$48=Daten!$A$146,\"\",IF(Zuschlag!AR47=0,\"\",Zuschlag!AR47))","v":""}]
[{"$f":"Zuschlag!A48","v":0},{"$f":"Zuschlag!B48","v":0},"","",{"$f":"IF(E$48=Daten!$A$146,\"\",IF(Zuschlag!F48=0,\"\",Zuschlag!F48))","v":""},{"$f":"IF(F$48=Daten!$A$146,\"\",IF(Zuschlag!G48=0,\"\",Zuschlag!G48))","v":""},{"$f":"IF(G$48=Daten!$A$146,\"\",IF(Zuschlag!H48=0,\"\",Zuschlag!H48))","v":""},{"$f":"IF(H$48=Daten!$A$146,\"\",IF(Zuschlag!I48=0,\"\",Zuschlag!I48))","v":""},{"$f":"IF(I$48=Daten!$A$146,\"\",IF(Zuschlag!J48=0,\"\",Zuschlag!J48))","v":""},{"$f":"IF(J$48=Daten!$A$146,\"\",IF(Zuschlag!K48=0,\"\",Zuschlag!K48))","v":""},{"$f":"IF(K$48=Daten!$A$146,\"\",IF(Zuschlag!L48=0,\"\",Zuschlag!L48))","v":""},{"$f":"IF(L$48=Daten!$A$146,\"\",IF(Zuschlag!M48=0,\"\",Zuschlag!M48))","v":""},{"$f":"IF(M$48=Daten!$A$146,\"\",IF(Zuschlag!N48=0,\"\",Zuschlag!N48))","v":""},{"$f":"IF(N$48=Daten!$A$146,\"\",IF(Zuschlag!O48=0,\"\",Zuschlag!O48))","v":""},{"$f":"IF(O$48=Daten!$A$146,\"\",IF(Zuschlag!P48=0,\"\",Zuschlag!P48))","v":""},{"$f":"IF(P$48=Daten!$A$146,\"\",IF(Zuschlag!Q48=0,\"\",Zuschlag!Q48))","v":""},{"$f":"IF(Q$48=Daten!$A$146,\"\",IF(Zuschlag!R48=0,\"\",Zuschlag!R48))","v":""},{"$f":"IF(R$48=Daten!$A$146,\"\",IF(Zuschlag!S48=0,\"\",Zuschlag!S48))","v":""},{"$f":"IF(S$48=Daten!$A$146,\"\",IF(Zuschlag!T48=0,\"\",Zuschlag!T48))","v":""},{"$f":"IF(T$48=Daten!$A$146,\"\",IF(Zuschlag!U48=0,\"\",Zuschlag!U48))","v":""},{"$f":"IF(U$48=Daten!$A$146,\"\",IF(Zuschlag!V48=0,\"\",Zuschlag!V48))","v":""},{"$f":"IF(V$48=Daten!$A$146,\"\",IF(Zuschlag!W48=0,\"\",Zuschlag!W48))","v":""},{"$f":"IF(W$48=Daten!$A$146,\"\",IF(Zuschlag!X48=0,\"\",Zuschlag!X48))","v":""},{"$f":"IF(X$48=Daten!$A$146,\"\",IF(Zuschlag!Y48=0,\"\",Zuschlag!Y48))","v":""},{"$f":"IF(Y$48=Daten!$A$146,\"\",IF(Zuschlag!Z48=0,\"\",Zuschlag!Z48))","v":""},{"$f":"IF(Z$48=Daten!$A$146,\"\",IF(Zuschlag!AA48=0,\"\",Zuschlag!AA48))","v":""},{"$f":"IF(AA$48=Daten!$A$146,\"\",IF(Zuschlag!AB48=0,\"\",Zuschlag!AB48))","v":""},{"$f":"IF(AB$48=Daten!$A$146,\"\",IF(Zuschlag!AC48=0,\"\",Zuschlag!AC48))","v":""},{"$f":"IF(AC$48=Daten!$A$146,\"\",IF(Zuschlag!AD48=0,\"\",Zuschlag!AD48))","v":""},{"$f":"IF(AD$48=Daten!$A$146,\"\",IF(Zuschlag!AE48=0,\"\",Zuschlag!AE48))","v":""},{"$f":"IF(AE$48=Daten!$A$146,\"\",IF(Zuschlag!AF48=0,\"\",Zuschlag!AF48))","v":""},{"$f":"IF(AF$48=Daten!$A$146,\"\",IF(Zuschlag!AG48=0,\"\",Zuschlag!AG48))","v":""},{"$f":"IF(AG$48=Daten!$A$146,\"\",IF(Zuschlag!AH48=0,\"\",Zuschlag!AH48))","v":""},{"$f":"IF(AH$48=Daten!$A$146,\"\",IF(Zuschlag!AI48=0,\"\",Zuschlag!AI48))","v":""},{"$f":"IF(AI$48=Daten!$A$146,\"\",IF(Zuschlag!AJ48=0,\"\",Zuschlag!AJ48))","v":""},{"$f":"IF(AJ$48=Daten!$A$146,\"\",IF(Zuschlag!AK48=0,\"\",Zuschlag!AK48))","v":""},{"$f":"IF(AK$48=Daten!$A$146,\"\",IF(Zuschlag!AL48=0,\"\",Zuschlag!AL48))","v":""},{"$f":"IF(AL$48=Daten!$A$146,\"\",IF(Zuschlag!AM48=0,\"\",Zuschlag!AM48))","v":""},{"$f":"IF(AM$48=Daten!$A$146,\"\",IF(Zuschlag!AN48=0,\"\",Zuschlag!AN48))","v":""},{"$f":"IF(AN$48=Daten!$A$146,\"\",IF(Zuschlag!AO48=0,\"\",Zuschlag!AO48))","v":""},{"$f":"IF(AO$48=Daten!$A$146,\"\",IF(Zuschlag!AP48=0,\"\",Zuschlag!AP48))","v":""},{"$f":"IF(AP$48=Daten!$A$146,\"\",IF(Zuschlag!AQ48=0,\"\",Zuschlag!AQ48))","v":""},{"$f":"IF(AQ$48=Daten!$A$146,\"\",IF(Zuschlag!AR48=0,\"\",Zuschlag!AR48))","v":""}]
[{"$f":"Zuschlag!A49","v":"6"},{"$f":"Zuschlag!B49","v":0},"","",{"$f":"IF(E$48=Daten!$A$146,\"\",IF(Zuschlag!F49=0,\"\",Zuschlag!F49))","v":""},{"$f":"IF(F$48=Daten!$A$146,\"\",IF(Zuschlag!G49=0,\"\",Zuschlag!G49))","v":""},{"$f":"IF(G$48=Daten!$A$146,\"\",IF(Zuschlag!H49=0,\"\",Zuschlag!H49))","v":""},{"$f":"IF(H$48=Daten!$A$146,\"\",IF(Zuschlag!I49=0,\"\",Zuschlag!I49))","v":""},{"$f":"IF(I$48=Daten!$A$146,\"\",IF(Zuschlag!J49=0,\"\",Zuschlag!J49))","v":""},{"$f":"IF(J$48=Daten!$A$146,\"\",IF(Zuschlag!K49=0,\"\",Zuschlag!K49))","v":""},{"$f":"IF(K$48=Daten!$A$146,\"\",IF(Zuschlag!L49=0,\"\",Zuschlag!L49))","v":""},{"$f":"IF(L$48=Daten!$A$146,\"\",IF(Zuschlag!M49=0,\"\",Zuschlag!M49))","v":""},{"$f":"IF(M$48=Daten!$A$146,\"\",IF(Zuschlag!N49=0,\"\",Zuschlag!N49))","v":""},{"$f":"IF(N$48=Daten!$A$146,\"\",IF(Zuschlag!O49=0,\"\",Zuschlag!O49))","v":""},{"$f":"IF(O$48=Daten!$A$146,\"\",IF(Zuschlag!P49=0,\"\",Zuschlag!P49))","v":""},{"$f":"IF(P$48=Daten!$A$146,\"\",IF(Zuschlag!Q49=0,\"\",Zuschlag!Q49))","v":""},{"$f":"IF(Q$48=Daten!$A$146,\"\",IF(Zuschlag!R49=0,\"\",Zuschlag!R49))","v":""},{"$f":"IF(R$48=Daten!$A$146,\"\",IF(Zuschlag!S49=0,\"\",Zuschlag!S49))","v":""},{"$f":"IF(S$48=Daten!$A$146,\"\",IF(Zuschlag!T49=0,\"\",Zuschlag!T49))","v":""},{"$f":"IF(T$48=Daten!$A$146,\"\",IF(Zuschlag!U49=0,\"\",Zuschlag!U49))","v":""},{"$f":"IF(U$48=Daten!$A$146,\"\",IF(Zuschlag!V49=0,\"\",Zuschlag!V49))","v":""},{"$f":"IF(V$48=Daten!$A$146,\"\",IF(Zuschlag!W49=0,\"\",Zuschlag!W49))","v":""},{"$f":"IF(W$48=Daten!$A$146,\"\",IF(Zuschlag!X49=0,\"\",Zuschlag!X49))","v":""},{"$f":"IF(X$48=Daten!$A$146,\"\",IF(Zuschlag!Y49=0,\"\",Zuschlag!Y49))","v":""},{"$f":"IF(Y$48=Daten!$A$146,\"\",IF(Zuschlag!Z49=0,\"\",Zuschlag!Z49))","v":""},{"$f":"IF(Z$48=Daten!$A$146,\"\",IF(Zuschlag!AA49=0,\"\",Zuschlag!AA49))","v":""},{"$f":"IF(AA$48=Daten!$A$146,\"\",IF(Zuschlag!AB49=0,\"\",Zuschlag!AB49))","v":""},{"$f":"IF(AB$48=Daten!$A$146,\"\",IF(Zuschlag!AC49=0,\"\",Zuschlag!AC49))","v":""},{"$f":"IF(AC$48=Daten!$A$146,\"\",IF(Zuschlag!AD49=0,\"\",Zuschlag!AD49))","v":""},{"$f":"IF(AD$48=Daten!$A$146,\"\",IF(Zuschlag!AE49=0,\"\",Zuschlag!AE49))","v":""},{"$f":"IF(AE$48=Daten!$A$146,\"\",IF(Zuschlag!AF49=0,\"\",Zuschlag!AF49))","v":""},{"$f":"IF(AF$48=Daten!$A$146,\"\",IF(Zuschlag!AG49=0,\"\",Zuschlag!AG49))","v":""},{"$f":"IF(AG$48=Daten!$A$146,\"\",IF(Zuschlag!AH49=0,\"\",Zuschlag!AH49))","v":""},{"$f":"IF(AH$48=Daten!$A$146,\"\",IF(Zuschlag!AI49=0,\"\",Zuschlag!AI49))","v":""},{"$f":"IF(AI$48=Daten!$A$146,\"\",IF(Zuschlag!AJ49=0,\"\",Zuschlag!AJ49))","v":""},{"$f":"IF(AJ$48=Daten!$A$146,\"\",IF(Zuschlag!AK49=0,\"\",Zuschlag!AK49))","v":""},{"$f":"IF(AK$48=Daten!$A$146,\"\",IF(Zuschlag!AL49=0,\"\",Zuschlag!AL49))","v":""},{"$f":"IF(AL$48=Daten!$A$146,\"\",IF(Zuschlag!AM49=0,\"\",Zuschlag!AM49))","v":""},{"$f":"IF(AM$48=Daten!$A$146,\"\",IF(Zuschlag!AN49=0,\"\",Zuschlag!AN49))","v":""},{"$f":"IF(AN$48=Daten!$A$146,\"\",IF(Zuschlag!AO49=0,\"\",Zuschlag!AO49))","v":""},{"$f":"IF(AO$48=Daten!$A$146,\"\",IF(Zuschlag!AP49=0,\"\",Zuschlag!AP49))","v":""},{"$f":"IF(AP$48=Daten!$A$146,\"\",IF(Zuschlag!AQ49=0,\"\",Zuschlag!AQ49))","v":""},{"$f":"IF(AQ$48=Daten!$A$146,\"\",IF(Zuschlag!AR49=0,\"\",Zuschlag!AR49))","v":""}]
[{"$f":"Zuschlag!A50","v":0},{"$f":"Zuschlag!B50","v":0},"","",{"$f":"IF(E$48=Daten!$A$146,\"\",IF(Zuschlag!F50=0,\"\",Zuschlag!F50))","v":""},{"$f":"IF(F$48=Daten!$A$146,\"\",IF(Zuschlag!G50=0,\"\",Zuschlag!G50))","v":""},{"$f":"IF(G$48=Daten!$A$146,\"\",IF(Zuschlag!H50=0,\"\",Zuschlag!H50))","v":""},{"$f":"IF(H$48=Daten!$A$146,\"\",IF(Zuschlag!I50=0,\"\",Zuschlag!I50))","v":""},{"$f":"IF(I$48=Daten!$A$146,\"\",IF(Zuschlag!J50=0,\"\",Zuschlag!J50))","v":""},{"$f":"IF(J$48=Daten!$A$146,\"\",IF(Zuschlag!K50=0,\"\",Zuschlag!K50))","v":""},{"$f":"IF(K$48=Daten!$A$146,\"\",IF(Zuschlag!L50=0,\"\",Zuschlag!L50))","v":""},{"$f":"IF(L$48=Daten!$A$146,\"\",IF(Zuschlag!M50=0,\"\",Zuschlag!M50))","v":""},{"$f":"IF(M$48=Daten!$A$146,\"\",IF(Zuschlag!N50=0,\"\",Zuschlag!N50))","v":""},{"$f":"IF(N$48=Daten!$A$146,\"\",IF(Zuschlag!O50=0,\"\",Zuschlag!O50))","v":""},{"$f":"IF(O$48=Daten!$A$146,\"\",IF(Zuschlag!P50=0,\"\",Zuschlag!P50))","v":""},{"$f":"IF(P$48=Daten!$A$146,\"\",IF(Zuschlag!Q50=0,\"\",Zuschlag!Q50))","v":""},{"$f":"IF(Q$48=Daten!$A$146,\"\",IF(Zuschlag!R50=0,\"\",Zuschlag!R50))","v":""},{"$f":"IF(R$48=Daten!$A$146,\"\",IF(Zuschlag!S50=0,\"\",Zuschlag!S50))","v":""},{"$f":"IF(S$48=Daten!$A$146,\"\",IF(Zuschlag!T50=0,\"\",Zuschlag!T50))","v":""},{"$f":"IF(T$48=Daten!$A$146,\"\",IF(Zuschlag!U50=0,\"\",Zuschlag!U50))","v":""},{"$f":"IF(U$48=Daten!$A$146,\"\",IF(Zuschlag!V50=0,\"\",Zuschlag!V50))","v":""},{"$f":"IF(V$48=Daten!$A$146,\"\",IF(Zuschlag!W50=0,\"\",Zuschlag!W50))","v":""},{"$f":"IF(W$48=Daten!$A$146,\"\",IF(Zuschlag!X50=0,\"\",Zuschlag!X50))","v":""},{"$f":"IF(X$48=Daten!$A$146,\"\",IF(Zuschlag!Y50=0,\"\",Zuschlag!Y50))","v":""},{"$f":"IF(Y$48=Daten!$A$146,\"\",IF(Zuschlag!Z50=0,\"\",Zuschlag!Z50))","v":""},{"$f":"IF(Z$48=Daten!$A$146,\"\",IF(Zuschlag!AA50=0,\"\",Zuschlag!AA50))","v":""},{"$f":"IF(AA$48=Daten!$A$146,\"\",IF(Zuschlag!AB50=0,\"\",Zuschlag!AB50))","v":""},{"$f":"IF(AB$48=Daten!$A$146,\"\",IF(Zuschlag!AC50=0,\"\",Zuschlag!AC50))","v":""},{"$f":"IF(AC$48=Daten!$A$146,\"\",IF(Zuschlag!AD50=0,\"\",Zuschlag!AD50))","v":""},{"$f":"IF(AD$48=Daten!$A$146,\"\",IF(Zuschlag!AE50=0,\"\",Zuschlag!AE50))","v":""},{"$f":"IF(AE$48=Daten!$A$146,\"\",IF(Zuschlag!AF50=0,\"\",Zuschlag!AF50))","v":""},{"$f":"IF(AF$48=Daten!$A$146,\"\",IF(Zuschlag!AG50=0,\"\",Zuschlag!AG50))","v":""},{"$f":"IF(AG$48=Daten!$A$146,\"\",IF(Zuschlag!AH50=0,\"\",Zuschlag!AH50))","v":""},{"$f":"IF(AH$48=Daten!$A$146,\"\",IF(Zuschlag!AI50=0,\"\",Zuschlag!AI50))","v":""},{"$f":"IF(AI$48=Daten!$A$146,\"\",IF(Zuschlag!AJ50=0,\"\",Zuschlag!AJ50))","v":""},{"$f":"IF(AJ$48=Daten!$A$146,\"\",IF(Zuschlag!AK50=0,\"\",Zuschlag!AK50))","v":""},{"$f":"IF(AK$48=Daten!$A$146,\"\",IF(Zuschlag!AL50=0,\"\",Zuschlag!AL50))","v":""},{"$f":"IF(AL$48=Daten!$A$146,\"\",IF(Zuschlag!AM50=0,\"\",Zuschlag!AM50))","v":""},{"$f":"IF(AM$48=Daten!$A$146,\"\",IF(Zuschlag!AN50=0,\"\",Zuschlag!AN50))","v":""},{"$f":"IF(AN$48=Daten!$A$146,\"\",IF(Zuschlag!AO50=0,\"\",Zuschlag!AO50))","v":""},{"$f":"IF(AO$48=Daten!$A$146,\"\",IF(Zuschlag!AP50=0,\"\",Zuschlag!AP50))","v":""},{"$f":"IF(AP$48=Daten!$A$146,\"\",IF(Zuschlag!AQ50=0,\"\",Zuschlag!AQ50))","v":""},{"$f":"IF(AQ$48=Daten!$A$146,\"\",IF(Zuschlag!AR50=0,\"\",Zuschlag!AR50))","v":""}]
[{"$f":"Zuschlag!A51","v":"6.1"},{"$f":"Zuschlag!B51","v":0},"","",{"$f":"IF(E$48=Daten!$A$146,\"\",IF(Zuschlag!F51=0,\"\",Zuschlag!F51))","v":""},{"$f":"IF(F$48=Daten!$A$146,\"\",IF(Zuschlag!G51=0,\"\",Zuschlag!G51))","v":""},{"$f":"IF(G$48=Daten!$A$146,\"\",IF(Zuschlag!H51=0,\"\",Zuschlag!H51))","v":""},{"$f":"IF(H$48=Daten!$A$146,\"\",IF(Zuschlag!I51=0,\"\",Zuschlag!I51))","v":""},{"$f":"IF(I$48=Daten!$A$146,\"\",IF(Zuschlag!J51=0,\"\",Zuschlag!J51))","v":""},{"$f":"IF(J$48=Daten!$A$146,\"\",IF(Zuschlag!K51=0,\"\",Zuschlag!K51))","v":""},{"$f":"IF(K$48=Daten!$A$146,\"\",IF(Zuschlag!L51=0,\"\",Zuschlag!L51))","v":""},{"$f":"IF(L$48=Daten!$A$146,\"\",IF(Zuschlag!M51=0,\"\",Zuschlag!M51))","v":""},{"$f":"IF(M$48=Daten!$A$146,\"\",IF(Zuschlag!N51=0,\"\",Zuschlag!N51))","v":""},{"$f":"IF(N$48=Daten!$A$146,\"\",IF(Zuschlag!O51=0,\"\",Zuschlag!O51))","v":""},{"$f":"IF(O$48=Daten!$A$146,\"\",IF(Zuschlag!P51=0,\"\",Zuschlag!P51))","v":""},{"$f":"IF(P$48=Daten!$A$146,\"\",IF(Zuschlag!Q51=0,\"\",Zuschlag!Q51))","v":""},{"$f":"IF(Q$48=Daten!$A$146,\"\",IF(Zuschlag!R51=0,\"\",Zuschlag!R51))","v":""},{"$f":"IF(R$48=Daten!$A$146,\"\",IF(Zuschlag!S51=0,\"\",Zuschlag!S51))","v":""},{"$f":"IF(S$48=Daten!$A$146,\"\",IF(Zuschlag!T51=0,\"\",Zuschlag!T51))","v":""},{"$f":"IF(T$48=Daten!$A$146,\"\",IF(Zuschlag!U51=0,\"\",Zuschlag!U51))","v":""},{"$f":"IF(U$48=Daten!$A$146,\"\",IF(Zuschlag!V51=0,\"\",Zuschlag!V51))","v":""},{"$f":"IF(V$48=Daten!$A$146,\"\",IF(Zuschlag!W51=0,\"\",Zuschlag!W51))","v":""},{"$f":"IF(W$48=Daten!$A$146,\"\",IF(Zuschlag!X51=0,\"\",Zuschlag!X51))","v":""},{"$f":"IF(X$48=Daten!$A$146,\"\",IF(Zuschlag!Y51=0,\"\",Zuschlag!Y51))","v":""},{"$f":"IF(Y$48=Daten!$A$146,\"\",IF(Zuschlag!Z51=0,\"\",Zuschlag!Z51))","v":""},{"$f":"IF(Z$48=Daten!$A$146,\"\",IF(Zuschlag!AA51=0,\"\",Zuschlag!AA51))","v":""},{"$f":"IF(AA$48=Daten!$A$146,\"\",IF(Zuschlag!AB51=0,\"\",Zuschlag!AB51))","v":""},{"$f":"IF(AB$48=Daten!$A$146,\"\",IF(Zuschlag!AC51=0,\"\",Zuschlag!AC51))","v":""},{"$f":"IF(AC$48=Daten!$A$146,\"\",IF(Zuschlag!AD51=0,\"\",Zuschlag!AD51))","v":""},{"$f":"IF(AD$48=Daten!$A$146,\"\",IF(Zuschlag!AE51=0,\"\",Zuschlag!AE51))","v":""},{"$f":"IF(AE$48=Daten!$A$146,\"\",IF(Zuschlag!AF51=0,\"\",Zuschlag!AF51))","v":""},{"$f":"IF(AF$48=Daten!$A$146,\"\",IF(Zuschlag!AG51=0,\"\",Zuschlag!AG51))","v":""},{"$f":"IF(AG$48=Daten!$A$146,\"\",IF(Zuschlag!AH51=0,\"\",Zuschlag!AH51))","v":""},{"$f":"IF(AH$48=Daten!$A$146,\"\",IF(Zuschlag!AI51=0,\"\",Zuschlag!AI51))","v":""},{"$f":"IF(AI$48=Daten!$A$146,\"\",IF(Zuschlag!AJ51=0,\"\",Zuschlag!AJ51))","v":""},{"$f":"IF(AJ$48=Daten!$A$146,\"\",IF(Zuschlag!AK51=0,\"\",Zuschlag!AK51))","v":""},{"$f":"IF(AK$48=Daten!$A$146,\"\",IF(Zuschlag!AL51=0,\"\",Zuschlag!AL51))","v":""},{"$f":"IF(AL$48=Daten!$A$146,\"\",IF(Zuschlag!AM51=0,\"\",Zuschlag!AM51))","v":""},{"$f":"IF(AM$48=Daten!$A$146,\"\",IF(Zuschlag!AN51=0,\"\",Zuschlag!AN51))","v":""},{"$f":"IF(AN$48=Daten!$A$146,\"\",IF(Zuschlag!AO51=0,\"\",Zuschlag!AO51))","v":""},{"$f":"IF(AO$48=Daten!$A$146,\"\",IF(Zuschlag!AP51=0,\"\",Zuschlag!AP51))","v":""},{"$f":"IF(AP$48=Daten!$A$146,\"\",IF(Zuschlag!AQ51=0,\"\",Zuschlag!AQ51))","v":""},{"$f":"IF(AQ$48=Daten!$A$146,\"\",IF(Zuschlag!AR51=0,\"\",Zuschlag!AR51))","v":""}]
[{"$f":"Zuschlag!A52","v":"6.2"},{"$f":"Zuschlag!B52","v":0},"","",{"$f":"IF(E$48=Daten!$A$146,\"\",IF(Zuschlag!F52=0,\"\",Zuschlag!F52))","v":""},{"$f":"IF(F$48=Daten!$A$146,\"\",IF(Zuschlag!G52=0,\"\",Zuschlag!G52))","v":""},{"$f":"IF(G$48=Daten!$A$146,\"\",IF(Zuschlag!H52=0,\"\",Zuschlag!H52))","v":""},{"$f":"IF(H$48=Daten!$A$146,\"\",IF(Zuschlag!I52=0,\"\",Zuschlag!I52))","v":""},{"$f":"IF(I$48=Daten!$A$146,\"\",IF(Zuschlag!J52=0,\"\",Zuschlag!J52))","v":""},{"$f":"IF(J$48=Daten!$A$146,\"\",IF(Zuschlag!K52=0,\"\",Zuschlag!K52))","v":""},{"$f":"IF(K$48=Daten!$A$146,\"\",IF(Zuschlag!L52=0,\"\",Zuschlag!L52))","v":""},{"$f":"IF(L$48=Daten!$A$146,\"\",IF(Zuschlag!M52=0,\"\",Zuschlag!M52))","v":""},{"$f":"IF(M$48=Daten!$A$146,\"\",IF(Zuschlag!N52=0,\"\",Zuschlag!N52))","v":""},{"$f":"IF(N$48=Daten!$A$146,\"\",IF(Zuschlag!O52=0,\"\",Zuschlag!O52))","v":""},{"$f":"IF(O$48=Daten!$A$146,\"\",IF(Zuschlag!P52=0,\"\",Zuschlag!P52))","v":""},{"$f":"IF(P$48=Daten!$A$146,\"\",IF(Zuschlag!Q52=0,\"\",Zuschlag!Q52))","v":""},{"$f":"IF(Q$48=Daten!$A$146,\"\",IF(Zuschlag!R52=0,\"\",Zuschlag!R52))","v":""},{"$f":"IF(R$48=Daten!$A$146,\"\",IF(Zuschlag!S52=0,\"\",Zuschlag!S52))","v":""},{"$f":"IF(S$48=Daten!$A$146,\"\",IF(Zuschlag!T52=0,\"\",Zuschlag!T52))","v":""},{"$f":"IF(T$48=Daten!$A$146,\"\",IF(Zuschlag!U52=0,\"\",Zuschlag!U52))","v":""},{"$f":"IF(U$48=Daten!$A$146,\"\",IF(Zuschlag!V52=0,\"\",Zuschlag!V52))","v":""},{"$f":"IF(V$48=Daten!$A$146,\"\",IF(Zuschlag!W52=0,\"\",Zuschlag!W52))","v":""},{"$f":"IF(W$48=Daten!$A$146,\"\",IF(Zuschlag!X52=0,\"\",Zuschlag!X52))","v":""},{"$f":"IF(X$48=Daten!$A$146,\"\",IF(Zuschlag!Y52=0,\"\",Zuschlag!Y52))","v":""},{"$f":"IF(Y$48=Daten!$A$146,\"\",IF(Zuschlag!Z52=0,\"\",Zuschlag!Z52))","v":""},{"$f":"IF(Z$48=Daten!$A$146,\"\",IF(Zuschlag!AA52=0,\"\",Zuschlag!AA52))","v":""},{"$f":"IF(AA$48=Daten!$A$146,\"\",IF(Zuschlag!AB52=0,\"\",Zuschlag!AB52))","v":""},{"$f":"IF(AB$48=Daten!$A$146,\"\",IF(Zuschlag!AC52=0,\"\",Zuschlag!AC52))","v":""},{"$f":"IF(AC$48=Daten!$A$146,\"\",IF(Zuschlag!AD52=0,\"\",Zuschlag!AD52))","v":""},{"$f":"IF(AD$48=Daten!$A$146,\"\",IF(Zuschlag!AE52=0,\"\",Zuschlag!AE52))","v":""},{"$f":"IF(AE$48=Daten!$A$146,\"\",IF(Zuschlag!AF52=0,\"\",Zuschlag!AF52))","v":""},{"$f":"IF(AF$48=Daten!$A$146,\"\",IF(Zuschlag!AG52=0,\"\",Zuschlag!AG52))","v":""},{"$f":"IF(AG$48=Daten!$A$146,\"\",IF(Zuschlag!AH52=0,\"\",Zuschlag!AH52))","v":""},{"$f":"IF(AH$48=Daten!$A$146,\"\",IF(Zuschlag!AI52=0,\"\",Zuschlag!AI52))","v":""},{"$f":"IF(AI$48=Daten!$A$146,\"\",IF(Zuschlag!AJ52=0,\"\",Zuschlag!AJ52))","v":""},{"$f":"IF(AJ$48=Daten!$A$146,\"\",IF(Zuschlag!AK52=0,\"\",Zuschlag!AK52))","v":""},{"$f":"IF(AK$48=Daten!$A$146,\"\",IF(Zuschlag!AL52=0,\"\",Zuschlag!AL52))","v":""},{"$f":"IF(AL$48=Daten!$A$146,\"\",IF(Zuschlag!AM52=0,\"\",Zuschlag!AM52))","v":""},{"$f":"IF(AM$48=Daten!$A$146,\"\",IF(Zuschlag!AN52=0,\"\",Zuschlag!AN52))","v":""},{"$f":"IF(AN$48=Daten!$A$146,\"\",IF(Zuschlag!AO52=0,\"\",Zuschlag!AO52))","v":""},{"$f":"IF(AO$48=Daten!$A$146,\"\",IF(Zuschlag!AP52=0,\"\",Zuschlag!AP52))","v":""},{"$f":"IF(AP$48=Daten!$A$146,\"\",IF(Zuschlag!AQ52=0,\"\",Zuschlag!AQ52))","v":""},{"$f":"IF(AQ$48=Daten!$A$146,\"\",IF(Zuschlag!AR52=0,\"\",Zuschlag!AR52))","v":""}]
[{"$f":"Zuschlag!A53","v":0},{"$f":"Zuschlag!B53","v":0},"","",{"$f":"IF(E$48=Daten!$A$146,\"\",IF(Zuschlag!F53=0,\"\",Zuschlag!F53))","v":""},{"$f":"IF(F$48=Daten!$A$146,\"\",IF(Zuschlag!G53=0,\"\",Zuschlag!G53))","v":""},{"$f":"IF(G$48=Daten!$A$146,\"\",IF(Zuschlag!H53=0,\"\",Zuschlag!H53))","v":""},{"$f":"IF(H$48=Daten!$A$146,\"\",IF(Zuschlag!I53=0,\"\",Zuschlag!I53))","v":""},{"$f":"IF(I$48=Daten!$A$146,\"\",IF(Zuschlag!J53=0,\"\",Zuschlag!J53))","v":""},{"$f":"IF(J$48=Daten!$A$146,\"\",IF(Zuschlag!K53=0,\"\",Zuschlag!K53))","v":""},{"$f":"IF(K$48=Daten!$A$146,\"\",IF(Zuschlag!L53=0,\"\",Zuschlag!L53))","v":""},{"$f":"IF(L$48=Daten!$A$146,\"\",IF(Zuschlag!M53=0,\"\",Zuschlag!M53))","v":""},{"$f":"IF(M$48=Daten!$A$146,\"\",IF(Zuschlag!N53=0,\"\",Zuschlag!N53))","v":""},{"$f":"IF(N$48=Daten!$A$146,\"\",IF(Zuschlag!O53=0,\"\",Zuschlag!O53))","v":""},{"$f":"IF(O$48=Daten!$A$146,\"\",IF(Zuschlag!P53=0,\"\",Zuschlag!P53))","v":""},{"$f":"IF(P$48=Daten!$A$146,\"\",IF(Zuschlag!Q53=0,\"\",Zuschlag!Q53))","v":""},{"$f":"IF(Q$48=Daten!$A$146,\"\",IF(Zuschlag!R53=0,\"\",Zuschlag!R53))","v":""},{"$f":"IF(R$48=Daten!$A$146,\"\",IF(Zuschlag!S53=0,\"\",Zuschlag!S53))","v":""},{"$f":"IF(S$48=Daten!$A$146,\"\",IF(Zuschlag!T53=0,\"\",Zuschlag!T53))","v":""},{"$f":"IF(T$48=Daten!$A$146,\"\",IF(Zuschlag!U53=0,\"\",Zuschlag!U53))","v":""},{"$f":"IF(U$48=Daten!$A$146,\"\",IF(Zuschlag!V53=0,\"\",Zuschlag!V53))","v":""},{"$f":"IF(V$48=Daten!$A$146,\"\",IF(Zuschlag!W53=0,\"\",Zuschlag!W53))","v":""},{"$f":"IF(W$48=Daten!$A$146,\"\",IF(Zuschlag!X53=0,\"\",Zuschlag!X53))","v":""},{"$f":"IF(X$48=Daten!$A$146,\"\",IF(Zuschlag!Y53=0,\"\",Zuschlag!Y53))","v":""},{"$f":"IF(Y$48=Daten!$A$146,\"\",IF(Zuschlag!Z53=0,\"\",Zuschlag!Z53))","v":""},{"$f":"IF(Z$48=Daten!$A$146,\"\",IF(Zuschlag!AA53=0,\"\",Zuschlag!AA53))","v":""},{"$f":"IF(AA$48=Daten!$A$146,\"\",IF(Zuschlag!AB53=0,\"\",Zuschlag!AB53))","v":""},{"$f":"IF(AB$48=Daten!$A$146,\"\",IF(Zuschlag!AC53=0,\"\",Zuschlag!AC53))","v":""},{"$f":"IF(AC$48=Daten!$A$146,\"\",IF(Zuschlag!AD53=0,\"\",Zuschlag!AD53))","v":""},{"$f":"IF(AD$48=Daten!$A$146,\"\",IF(Zuschlag!AE53=0,\"\",Zuschlag!AE53))","v":""},{"$f":"IF(AE$48=Daten!$A$146,\"\",IF(Zuschlag!AF53=0,\"\",Zuschlag!AF53))","v":""},{"$f":"IF(AF$48=Daten!$A$146,\"\",IF(Zuschlag!AG53=0,\"\",Zuschlag!AG53))","v":""},{"$f":"IF(AG$48=Daten!$A$146,\"\",IF(Zuschlag!AH53=0,\"\",Zuschlag!AH53))","v":""},{"$f":"IF(AH$48=Daten!$A$146,\"\",IF(Zuschlag!AI53=0,\"\",Zuschlag!AI53))","v":""},{"$f":"IF(AI$48=Daten!$A$146,\"\",IF(Zuschlag!AJ53=0,\"\",Zuschlag!AJ53))","v":""},{"$f":"IF(AJ$48=Daten!$A$146,\"\",IF(Zuschlag!AK53=0,\"\",Zuschlag!AK53))","v":""},{"$f":"IF(AK$48=Daten!$A$146,\"\",IF(Zuschlag!AL53=0,\"\",Zuschlag!AL53))","v":""},{"$f":"IF(AL$48=Daten!$A$146,\"\",IF(Zuschlag!AM53=0,\"\",Zuschlag!AM53))","v":""},{"$f":"IF(AM$48=Daten!$A$146,\"\",IF(Zuschlag!AN53=0,\"\",Zuschlag!AN53))","v":""},{"$f":"IF(AN$48=Daten!$A$146,\"\",IF(Zuschlag!AO53=0,\"\",Zuschlag!AO53))","v":""},{"$f":"IF(AO$48=Daten!$A$146,\"\",IF(Zuschlag!AP53=0,\"\",Zuschlag!AP53))","v":""},{"$f":"IF(AP$48=Daten!$A$146,\"\",IF(Zuschlag!AQ53=0,\"\",Zuschlag!AQ53))","v":""},{"$f":"IF(AQ$48=Daten!$A$146,\"\",IF(Zuschlag!AR53=0,\"\",Zuschlag!AR53))","v":""}]
[{"$f":"Zuschlag!A54","v":"7"},{"$f":"Zuschlag!B54","v":0},"","",{"$f":"IF(E$48=Daten!$A$146,\"\",IF(Zuschlag!F54=0,\"\",Zuschlag!F54))","v":""},{"$f":"IF(F$48=Daten!$A$146,\"\",IF(Zuschlag!G54=0,\"\",Zuschlag!G54))","v":""},{"$f":"IF(G$48=Daten!$A$146,\"\",IF(Zuschlag!H54=0,\"\",Zuschlag!H54))","v":""},{"$f":"IF(H$48=Daten!$A$146,\"\",IF(Zuschlag!I54=0,\"\",Zuschlag!I54))","v":""},{"$f":"IF(I$48=Daten!$A$146,\"\",IF(Zuschlag!J54=0,\"\",Zuschlag!J54))","v":""},{"$f":"IF(J$48=Daten!$A$146,\"\",IF(Zuschlag!K54=0,\"\",Zuschlag!K54))","v":""},{"$f":"IF(K$48=Daten!$A$146,\"\",IF(Zuschlag!L54=0,\"\",Zuschlag!L54))","v":""},{"$f":"IF(L$48=Daten!$A$146,\"\",IF(Zuschlag!M54=0,\"\",Zuschlag!M54))","v":""},{"$f":"IF(M$48=Daten!$A$146,\"\",IF(Zuschlag!N54=0,\"\",Zuschlag!N54))","v":""},{"$f":"IF(N$48=Daten!$A$146,\"\",IF(Zuschlag!O54=0,\"\",Zuschlag!O54))","v":""},{"$f":"IF(O$48=Daten!$A$146,\"\",IF(Zuschlag!P54=0,\"\",Zuschlag!P54))","v":""},{"$f":"IF(P$48=Daten!$A$146,\"\",IF(Zuschlag!Q54=0,\"\",Zuschlag!Q54))","v":""},{"$f":"IF(Q$48=Daten!$A$146,\"\",IF(Zuschlag!R54=0,\"\",Zuschlag!R54))","v":""},{"$f":"IF(R$48=Daten!$A$146,\"\",IF(Zuschlag!S54=0,\"\",Zuschlag!S54))","v":""},{"$f":"IF(S$48=Daten!$A$146,\"\",IF(Zuschlag!T54=0,\"\",Zuschlag!T54))","v":""},{"$f":"IF(T$48=Daten!$A$146,\"\",IF(Zuschlag!U54=0,\"\",Zuschlag!U54))","v":""},{"$f":"IF(U$48=Daten!$A$146,\"\",IF(Zuschlag!V54=0,\"\",Zuschlag!V54))","v":""},{"$f":"IF(V$48=Daten!$A$146,\"\",IF(Zuschlag!W54=0,\"\",Zuschlag!W54))","v":""},{"$f":"IF(W$48=Daten!$A$146,\"\",IF(Zuschlag!X54=0,\"\",Zuschlag!X54))","v":""},{"$f":"IF(X$48=Daten!$A$146,\"\",IF(Zuschlag!Y54=0,\"\",Zuschlag!Y54))","v":""},{"$f":"IF(Y$48=Daten!$A$146,\"\",IF(Zuschlag!Z54=0,\"\",Zuschlag!Z54))","v":""},{"$f":"IF(Z$48=Daten!$A$146,\"\",IF(Zuschlag!AA54=0,\"\",Zuschlag!AA54))","v":""},{"$f":"IF(AA$48=Daten!$A$146,\"\",IF(Zuschlag!AB54=0,\"\",Zuschlag!AB54))","v":""},{"$f":"IF(AB$48=Daten!$A$146,\"\",IF(Zuschlag!AC54=0,\"\",Zuschlag!AC54))","v":""},{"$f":"IF(AC$48=Daten!$A$146,\"\",IF(Zuschlag!AD54=0,\"\",Zuschlag!AD54))","v":""},{"$f":"IF(AD$48=Daten!$A$146,\"\",IF(Zuschlag!AE54=0,\"\",Zuschlag!AE54))","v":""},{"$f":"IF(AE$48=Daten!$A$146,\"\",IF(Zuschlag!AF54=0,\"\",Zuschlag!AF54))","v":""},{"$f":"IF(AF$48=Daten!$A$146,\"\",IF(Zuschlag!AG54=0,\"\",Zuschlag!AG54))","v":""},{"$f":"IF(AG$48=Daten!$A$146,\"\",IF(Zuschlag!AH54=0,\"\",Zuschlag!AH54))","v":""},{"$f":"IF(AH$48=Daten!$A$146,\"\",IF(Zuschlag!AI54=0,\"\",Zuschlag!AI54))","v":""},{"$f":"IF(AI$48=Daten!$A$146,\"\",IF(Zuschlag!AJ54=0,\"\",Zuschlag!AJ54))","v":""},{"$f":"IF(AJ$48=Daten!$A$146,\"\",IF(Zuschlag!AK54=0,\"\",Zuschlag!AK54))","v":""},{"$f":"IF(AK$48=Daten!$A$146,\"\",IF(Zuschlag!AL54=0,\"\",Zuschlag!AL54))","v":""},{"$f":"IF(AL$48=Daten!$A$146,\"\",IF(Zuschlag!AM54=0,\"\",Zuschlag!AM54))","v":""},{"$f":"IF(AM$48=Daten!$A$146,\"\",IF(Zuschlag!AN54=0,\"\",Zuschlag!AN54))","v":""},{"$f":"IF(AN$48=Daten!$A$146,\"\",IF(Zuschlag!AO54=0,\"\",Zuschlag!AO54))","v":""},{"$f":"IF(AO$48=Daten!$A$146,\"\",IF(Zuschlag!AP54=0,\"\",Zuschlag!AP54))","v":""},{"$f":"IF(AP$48=Daten!$A$146,\"\",IF(Zuschlag!AQ54=0,\"\",Zuschlag!AQ54))","v":""},{"$f":"IF(AQ$48=Daten!$A$146,\"\",IF(Zuschlag!AR54=0,\"\",Zuschlag!AR54))","v":""}]
[{"$f":"Zuschlag!A55","v":0},{"$f":"Zuschlag!B55","v":0},"","",{"$f":"IF(E$48=Daten!$A$146,\"\",IF(Zuschlag!F55=0,\"\",Zuschlag!F55))","v":""},{"$f":"IF(F$48=Daten!$A$146,\"\",IF(Zuschlag!G55=0,\"\",Zuschlag!G55))","v":""},{"$f":"IF(G$48=Daten!$A$146,\"\",IF(Zuschlag!H55=0,\"\",Zuschlag!H55))","v":""},{"$f":"IF(H$48=Daten!$A$146,\"\",IF(Zuschlag!I55=0,\"\",Zuschlag!I55))","v":""},{"$f":"IF(I$48=Daten!$A$146,\"\",IF(Zuschlag!J55=0,\"\",Zuschlag!J55))","v":""},{"$f":"IF(J$48=Daten!$A$146,\"\",IF(Zuschlag!K55=0,\"\",Zuschlag!K55))","v":""},{"$f":"IF(K$48=Daten!$A$146,\"\",IF(Zuschlag!L55=0,\"\",Zuschlag!L55))","v":""},{"$f":"IF(L$48=Daten!$A$146,\"\",IF(Zuschlag!M55=0,\"\",Zuschlag!M55))","v":""},{"$f":"IF(M$48=Daten!$A$146,\"\",IF(Zuschlag!N55=0,\"\",Zuschlag!N55))","v":""},{"$f":"IF(N$48=Daten!$A$146,\"\",IF(Zuschlag!O55=0,\"\",Zuschlag!O55))","v":""},{"$f":"IF(O$48=Daten!$A$146,\"\",IF(Zuschlag!P55=0,\"\",Zuschlag!P55))","v":""},{"$f":"IF(P$48=Daten!$A$146,\"\",IF(Zuschlag!Q55=0,\"\",Zuschlag!Q55))","v":""},{"$f":"IF(Q$48=Daten!$A$146,\"\",IF(Zuschlag!R55=0,\"\",Zuschlag!R55))","v":""},{"$f":"IF(R$48=Daten!$A$146,\"\",IF(Zuschlag!S55=0,\"\",Zuschlag!S55))","v":""},{"$f":"IF(S$48=Daten!$A$146,\"\",IF(Zuschlag!T55=0,\"\",Zuschlag!T55))","v":""},{"$f":"IF(T$48=Daten!$A$146,\"\",IF(Zuschlag!U55=0,\"\",Zuschlag!U55))","v":""},{"$f":"IF(U$48=Daten!$A$146,\"\",IF(Zuschlag!V55=0,\"\",Zuschlag!V55))","v":""},{"$f":"IF(V$48=Daten!$A$146,\"\",IF(Zuschlag!W55=0,\"\",Zuschlag!W55))","v":""},{"$f":"IF(W$48=Daten!$A$146,\"\",IF(Zuschlag!X55=0,\"\",Zuschlag!X55))","v":""},{"$f":"IF(X$48=Daten!$A$146,\"\",IF(Zuschlag!Y55=0,\"\",Zuschlag!Y55))","v":""},{"$f":"IF(Y$48=Daten!$A$146,\"\",IF(Zuschlag!Z55=0,\"\",Zuschlag!Z55))","v":""},{"$f":"IF(Z$48=Daten!$A$146,\"\",IF(Zuschlag!AA55=0,\"\",Zuschlag!AA55))","v":""},{"$f":"IF(AA$48=Daten!$A$146,\"\",IF(Zuschlag!AB55=0,\"\",Zuschlag!AB55))","v":""},{"$f":"IF(AB$48=Daten!$A$146,\"\",IF(Zuschlag!AC55=0,\"\",Zuschlag!AC55))","v":""},{"$f":"IF(AC$48=Daten!$A$146,\"\",IF(Zuschlag!AD55=0,\"\",Zuschlag!AD55))","v":""},{"$f":"IF(AD$48=Daten!$A$146,\"\",IF(Zuschlag!AE55=0,\"\",Zuschlag!AE55))","v":""},{"$f":"IF(AE$48=Daten!$A$146,\"\",IF(Zuschlag!AF55=0,\"\",Zuschlag!AF55))","v":""},{"$f":"IF(AF$48=Daten!$A$146,\"\",IF(Zuschlag!AG55=0,\"\",Zuschlag!AG55))","v":""},{"$f":"IF(AG$48=Daten!$A$146,\"\",IF(Zuschlag!AH55=0,\"\",Zuschlag!AH55))","v":""},{"$f":"IF(AH$48=Daten!$A$146,\"\",IF(Zuschlag!AI55=0,\"\",Zuschlag!AI55))","v":""},{"$f":"IF(AI$48=Daten!$A$146,\"\",IF(Zuschlag!AJ55=0,\"\",Zuschlag!AJ55))","v":""},{"$f":"IF(AJ$48=Daten!$A$146,\"\",IF(Zuschlag!AK55=0,\"\",Zuschlag!AK55))","v":""},{"$f":"IF(AK$48=Daten!$A$146,\"\",IF(Zuschlag!AL55=0,\"\",Zuschlag!AL55))","v":""},{"$f":"IF(AL$48=Daten!$A$146,\"\",IF(Zuschlag!AM55=0,\"\",Zuschlag!AM55))","v":""},{"$f":"IF(AM$48=Daten!$A$146,\"\",IF(Zuschlag!AN55=0,\"\",Zuschlag!AN55))","v":""},{"$f":"IF(AN$48=Daten!$A$146,\"\",IF(Zuschlag!AO55=0,\"\",Zuschlag!AO55))","v":""},{"$f":"IF(AO$48=Daten!$A$146,\"\",IF(Zuschlag!AP55=0,\"\",Zuschlag!AP55))","v":""},{"$f":"IF(AP$48=Daten!$A$146,\"\",IF(Zuschlag!AQ55=0,\"\",Zuschlag!AQ55))","v":""},{"$f":"IF(AQ$48=Daten!$A$146,\"\",IF(Zuschlag!AR55=0,\"\",Zuschlag!AR55))","v":""}]
[{"$f":"Zuschlag!A56","v":"7.1"},{"$f":"Zuschlag!B56","v":0},"","",{"$f":"IF(E$48=Daten!$A$146,\"\",IF(Zuschlag!F56=0,\"\",Zuschlag!F56))","v":""},{"$f":"IF(F$48=Daten!$A$146,\"\",IF(Zuschlag!G56=0,\"\",Zuschlag!G56))","v":""},{"$f":"IF(G$48=Daten!$A$146,\"\",IF(Zuschlag!H56=0,\"\",Zuschlag!H56))","v":""},{"$f":"IF(H$48=Daten!$A$146,\"\",IF(Zuschlag!I56=0,\"\",Zuschlag!I56))","v":""},{"$f":"IF(I$48=Daten!$A$146,\"\",IF(Zuschlag!J56=0,\"\",Zuschlag!J56))","v":""},{"$f":"IF(J$48=Daten!$A$146,\"\",IF(Zuschlag!K56=0,\"\",Zuschlag!K56))","v":""},{"$f":"IF(K$48=Daten!$A$146,\"\",IF(Zuschlag!L56=0,\"\",Zuschlag!L56))","v":""},{"$f":"IF(L$48=Daten!$A$146,\"\",IF(Zuschlag!M56=0,\"\",Zuschlag!M56))","v":""},{"$f":"IF(M$48=Daten!$A$146,\"\",IF(Zuschlag!N56=0,\"\",Zuschlag!N56))","v":""},{"$f":"IF(N$48=Daten!$A$146,\"\",IF(Zuschlag!O56=0,\"\",Zuschlag!O56))","v":""},{"$f":"IF(O$48=Daten!$A$146,\"\",IF(Zuschlag!P56=0,\"\",Zuschlag!P56))","v":""},{"$f":"IF(P$48=Daten!$A$146,\"\",IF(Zuschlag!Q56=0,\"\",Zuschlag!Q56))","v":""},{"$f":"IF(Q$48=Daten!$A$146,\"\",IF(Zuschlag!R56=0,\"\",Zuschlag!R56))","v":""},{"$f":"IF(R$48=Daten!$A$146,\"\",IF(Zuschlag!S56=0,\"\",Zuschlag!S56))","v":""},{"$f":"IF(S$48=Daten!$A$146,\"\",IF(Zuschlag!T56=0,\"\",Zuschlag!T56))","v":""},{"$f":"IF(T$48=Daten!$A$146,\"\",IF(Zuschlag!U56=0,\"\",Zuschlag!U56))","v":""},{"$f":"IF(U$48=Daten!$A$146,\"\",IF(Zuschlag!V56=0,\"\",Zuschlag!V56))","v":""},{"$f":"IF(V$48=Daten!$A$146,\"\",IF(Zuschlag!W56=0,\"\",Zuschlag!W56))","v":""},{"$f":"IF(W$48=Daten!$A$146,\"\",IF(Zuschlag!X56=0,\"\",Zuschlag!X56))","v":""},{"$f":"IF(X$48=Daten!$A$146,\"\",IF(Zuschlag!Y56=0,\"\",Zuschlag!Y56))","v":""},{"$f":"IF(Y$48=Daten!$A$146,\"\",IF(Zuschlag!Z56=0,\"\",Zuschlag!Z56))","v":""},{"$f":"IF(Z$48=Daten!$A$146,\"\",IF(Zuschlag!AA56=0,\"\",Zuschlag!AA56))","v":""},{"$f":"IF(AA$48=Daten!$A$146,\"\",IF(Zuschlag!AB56=0,\"\",Zuschlag!AB56))","v":""},{"$f":"IF(AB$48=Daten!$A$146,\"\",IF(Zuschlag!AC56=0,\"\",Zuschlag!AC56))","v":""},{"$f":"IF(AC$48=Daten!$A$146,\"\",IF(Zuschlag!AD56=0,\"\",Zuschlag!AD56))","v":""},{"$f":"IF(AD$48=Daten!$A$146,\"\",IF(Zuschlag!AE56=0,\"\",Zuschlag!AE56))","v":""},{"$f":"IF(AE$48=Daten!$A$146,\"\",IF(Zuschlag!AF56=0,\"\",Zuschlag!AF56))","v":""},{"$f":"IF(AF$48=Daten!$A$146,\"\",IF(Zuschlag!AG56=0,\"\",Zuschlag!AG56))","v":""},{"$f":"IF(AG$48=Daten!$A$146,\"\",IF(Zuschlag!AH56=0,\"\",Zuschlag!AH56))","v":""},{"$f":"IF(AH$48=Daten!$A$146,\"\",IF(Zuschlag!AI56=0,\"\",Zuschlag!AI56))","v":""},{"$f":"IF(AI$48=Daten!$A$146,\"\",IF(Zuschlag!AJ56=0,\"\",Zuschlag!AJ56))","v":""},{"$f":"IF(AJ$48=Daten!$A$146,\"\",IF(Zuschlag!AK56=0,\"\",Zuschlag!AK56))","v":""},{"$f":"IF(AK$48=Daten!$A$146,\"\",IF(Zuschlag!AL56=0,\"\",Zuschlag!AL56))","v":""},{"$f":"IF(AL$48=Daten!$A$146,\"\",IF(Zuschlag!AM56=0,\"\",Zuschlag!AM56))","v":""},{"$f":"IF(AM$48=Daten!$A$146,\"\",IF(Zuschlag!AN56=0,\"\",Zuschlag!AN56))","v":""},{"$f":"IF(AN$48=Daten!$A$146,\"\",IF(Zuschlag!AO56=0,\"\",Zuschlag!AO56))","v":""},{"$f":"IF(AO$48=Daten!$A$146,\"\",IF(Zuschlag!AP56=0,\"\",Zuschlag!AP56))","v":""},{"$f":"IF(AP$48=Daten!$A$146,\"\",IF(Zuschlag!AQ56=0,\"\",Zuschlag!AQ56))","v":""},{"$f":"IF(AQ$48=Daten!$A$146,\"\",IF(Zuschlag!AR56=0,\"\",Zuschlag!AR56))","v":""}]
[{"$f":"Zuschlag!A57","v":"7.2"},{"$f":"Zuschlag!B57","v":0},"","",{"$f":"IF(E$48=Daten!$A$146,\"\",IF(Zuschlag!F57=0,\"\",Zuschlag!F57))","v":""},{"$f":"IF(F$48=Daten!$A$146,\"\",IF(Zuschlag!G57=0,\"\",Zuschlag!G57))","v":""},{"$f":"IF(G$48=Daten!$A$146,\"\",IF(Zuschlag!H57=0,\"\",Zuschlag!H57))","v":""},{"$f":"IF(H$48=Daten!$A$146,\"\",IF(Zuschlag!I57=0,\"\",Zuschlag!I57))","v":""},{"$f":"IF(I$48=Daten!$A$146,\"\",IF(Zuschlag!J57=0,\"\",Zuschlag!J57))","v":""},{"$f":"IF(J$48=Daten!$A$146,\"\",IF(Zuschlag!K57=0,\"\",Zuschlag!K57))","v":""},{"$f":"IF(K$48=Daten!$A$146,\"\",IF(Zuschlag!L57=0,\"\",Zuschlag!L57))","v":""},{"$f":"IF(L$48=Daten!$A$146,\"\",IF(Zuschlag!M57=0,\"\",Zuschlag!M57))","v":""},{"$f":"IF(M$48=Daten!$A$146,\"\",IF(Zuschlag!N57=0,\"\",Zuschlag!N57))","v":""},{"$f":"IF(N$48=Daten!$A$146,\"\",IF(Zuschlag!O57=0,\"\",Zuschlag!O57))","v":""},{"$f":"IF(O$48=Daten!$A$146,\"\",IF(Zuschlag!P57=0,\"\",Zuschlag!P57))","v":""},{"$f":"IF(P$48=Daten!$A$146,\"\",IF(Zuschlag!Q57=0,\"\",Zuschlag!Q57))","v":""},{"$f":"IF(Q$48=Daten!$A$146,\"\",IF(Zuschlag!R57=0,\"\",Zuschlag!R57))","v":""},{"$f":"IF(R$48=Daten!$A$146,\"\",IF(Zuschlag!S57=0,\"\",Zuschlag!S57))","v":""},{"$f":"IF(S$48=Daten!$A$146,\"\",IF(Zuschlag!T57=0,\"\",Zuschlag!T57))","v":""},{"$f":"IF(T$48=Daten!$A$146,\"\",IF(Zuschlag!U57=0,\"\",Zuschlag!U57))","v":""},{"$f":"IF(U$48=Daten!$A$146,\"\",IF(Zuschlag!V57=0,\"\",Zuschlag!V57))","v":""},{"$f":"IF(V$48=Daten!$A$146,\"\",IF(Zuschlag!W57=0,\"\",Zuschlag!W57))","v":""},{"$f":"IF(W$48=Daten!$A$146,\"\",IF(Zuschlag!X57=0,\"\",Zuschlag!X57))","v":""},{"$f":"IF(X$48=Daten!$A$146,\"\",IF(Zuschlag!Y57=0,\"\",Zuschlag!Y57))","v":""},{"$f":"IF(Y$48=Daten!$A$146,\"\",IF(Zuschlag!Z57=0,\"\",Zuschlag!Z57))","v":""},{"$f":"IF(Z$48=Daten!$A$146,\"\",IF(Zuschlag!AA57=0,\"\",Zuschlag!AA57))","v":""},{"$f":"IF(AA$48=Daten!$A$146,\"\",IF(Zuschlag!AB57=0,\"\",Zuschlag!AB57))","v":""},{"$f":"IF(AB$48=Daten!$A$146,\"\",IF(Zuschlag!AC57=0,\"\",Zuschlag!AC57))","v":""},{"$f":"IF(AC$48=Daten!$A$146,\"\",IF(Zuschlag!AD57=0,\"\",Zuschlag!AD57))","v":""},{"$f":"IF(AD$48=Daten!$A$146,\"\",IF(Zuschlag!AE57=0,\"\",Zuschlag!AE57))","v":""},{"$f":"IF(AE$48=Daten!$A$146,\"\",IF(Zuschlag!AF57=0,\"\",Zuschlag!AF57))","v":""},{"$f":"IF(AF$48=Daten!$A$146,\"\",IF(Zuschlag!AG57=0,\"\",Zuschlag!AG57))","v":""},{"$f":"IF(AG$48=Daten!$A$146,\"\",IF(Zuschlag!AH57=0,\"\",Zuschlag!AH57))","v":""},{"$f":"IF(AH$48=Daten!$A$146,\"\",IF(Zuschlag!AI57=0,\"\",Zuschlag!AI57))","v":""},{"$f":"IF(AI$48=Daten!$A$146,\"\",IF(Zuschlag!AJ57=0,\"\",Zuschlag!AJ57))","v":""},{"$f":"IF(AJ$48=Daten!$A$146,\"\",IF(Zuschlag!AK57=0,\"\",Zuschlag!AK57))","v":""},{"$f":"IF(AK$48=Daten!$A$146,\"\",IF(Zuschlag!AL57=0,\"\",Zuschlag!AL57))","v":""},{"$f":"IF(AL$48=Daten!$A$146,\"\",IF(Zuschlag!AM57=0,\"\",Zuschlag!AM57))","v":""},{"$f":"IF(AM$48=Daten!$A$146,\"\",IF(Zuschlag!AN57=0,\"\",Zuschlag!AN57))","v":""},{"$f":"IF(AN$48=Daten!$A$146,\"\",IF(Zuschlag!AO57=0,\"\",Zuschlag!AO57))","v":""},{"$f":"IF(AO$48=Daten!$A$146,\"\",IF(Zuschlag!AP57=0,\"\",Zuschlag!AP57))","v":""},{"$f":"IF(AP$48=Daten!$A$146,\"\",IF(Zuschlag!AQ57=0,\"\",Zuschlag!AQ57))","v":""},{"$f":"IF(AQ$48=Daten!$A$146,\"\",IF(Zuschlag!AR57=0,\"\",Zuschlag!AR57))","v":""}]
[{"$f":"Zuschlag!A58","v":0},{"$f":"Zuschlag!B58","v":0},"","",{"$f":"IF(E$48=Daten!$A$146,\"\",IF(Zuschlag!F58=0,\"\",Zuschlag!F58))","v":""},{"$f":"IF(F$48=Daten!$A$146,\"\",IF(Zuschlag!G58=0,\"\",Zuschlag!G58))","v":""},{"$f":"IF(G$48=Daten!$A$146,\"\",IF(Zuschlag!H58=0,\"\",Zuschlag!H58))","v":""},{"$f":"IF(H$48=Daten!$A$146,\"\",IF(Zuschlag!I58=0,\"\",Zuschlag!I58))","v":""},{"$f":"IF(I$48=Daten!$A$146,\"\",IF(Zuschlag!J58=0,\"\",Zuschlag!J58))","v":""},{"$f":"IF(J$48=Daten!$A$146,\"\",IF(Zuschlag!K58=0,\"\",Zuschlag!K58))","v":""},{"$f":"IF(K$48=Daten!$A$146,\"\",IF(Zuschlag!L58=0,\"\",Zuschlag!L58))","v":""},{"$f":"IF(L$48=Daten!$A$146,\"\",IF(Zuschlag!M58=0,\"\",Zuschlag!M58))","v":""},{"$f":"IF(M$48=Daten!$A$146,\"\",IF(Zuschlag!N58=0,\"\",Zuschlag!N58))","v":""},{"$f":"IF(N$48=Daten!$A$146,\"\",IF(Zuschlag!O58=0,\"\",Zuschlag!O58))","v":""},{"$f":"IF(O$48=Daten!$A$146,\"\",IF(Zuschlag!P58=0,\"\",Zuschlag!P58))","v":""},{"$f":"IF(P$48=Daten!$A$146,\"\",IF(Zuschlag!Q58=0,\"\",Zuschlag!Q58))","v":""},{"$f":"IF(Q$48=Daten!$A$146,\"\",IF(Zuschlag!R58=0,\"\",Zuschlag!R58))","v":""},{"$f":"IF(R$48=Daten!$A$146,\"\",IF(Zuschlag!S58=0,\"\",Zuschlag!S58))","v":""},{"$f":"IF(S$48=Daten!$A$146,\"\",IF(Zuschlag!T58=0,\"\",Zuschlag!T58))","v":""},{"$f":"IF(T$48=Daten!$A$146,\"\",IF(Zuschlag!U58=0,\"\",Zuschlag!U58))","v":""},{"$f":"IF(U$48=Daten!$A$146,\"\",IF(Zuschlag!V58=0,\"\",Zuschlag!V58))","v":""},{"$f":"IF(V$48=Daten!$A$146,\"\",IF(Zuschlag!W58=0,\"\",Zuschlag!W58))","v":""},{"$f":"IF(W$48=Daten!$A$146,\"\",IF(Zuschlag!X58=0,\"\",Zuschlag!X58))","v":""},{"$f":"IF(X$48=Daten!$A$146,\"\",IF(Zuschlag!Y58=0,\"\",Zuschlag!Y58))","v":""},{"$f":"IF(Y$48=Daten!$A$146,\"\",IF(Zuschlag!Z58=0,\"\",Zuschlag!Z58))","v":""},{"$f":"IF(Z$48=Daten!$A$146,\"\",IF(Zuschlag!AA58=0,\"\",Zuschlag!AA58))","v":""},{"$f":"IF(AA$48=Daten!$A$146,\"\",IF(Zuschlag!AB58=0,\"\",Zuschlag!AB58))","v":""},{"$f":"IF(AB$48=Daten!$A$146,\"\",IF(Zuschlag!AC58=0,\"\",Zuschlag!AC58))","v":""},{"$f":"IF(AC$48=Daten!$A$146,\"\",IF(Zuschlag!AD58=0,\"\",Zuschlag!AD58))","v":""},{"$f":"IF(AD$48=Daten!$A$146,\"\",IF(Zuschlag!AE58=0,\"\",Zuschlag!AE58))","v":""},{"$f":"IF(AE$48=Daten!$A$146,\"\",IF(Zuschlag!AF58=0,\"\",Zuschlag!AF58))","v":""},{"$f":"IF(AF$48=Daten!$A$146,\"\",IF(Zuschlag!AG58=0,\"\",Zuschlag!AG58))","v":""},{"$f":"IF(AG$48=Daten!$A$146,\"\",IF(Zuschlag!AH58=0,\"\",Zuschlag!AH58))","v":""},{"$f":"IF(AH$48=Daten!$A$146,\"\",IF(Zuschlag!AI58=0,\"\",Zuschlag!AI58))","v":""},{"$f":"IF(AI$48=Daten!$A$146,\"\",IF(Zuschlag!AJ58=0,\"\",Zuschlag!AJ58))","v":""},{"$f":"IF(AJ$48=Daten!$A$146,\"\",IF(Zuschlag!AK58=0,\"\",Zuschlag!AK58))","v":""},{"$f":"IF(AK$48=Daten!$A$146,\"\",IF(Zuschlag!AL58=0,\"\",Zuschlag!AL58))","v":""},{"$f":"IF(AL$48=Daten!$A$146,\"\",IF(Zuschlag!AM58=0,\"\",Zuschlag!AM58))","v":""},{"$f":"IF(AM$48=Daten!$A$146,\"\",IF(Zuschlag!AN58=0,\"\",Zuschlag!AN58))","v":""},{"$f":"IF(AN$48=Daten!$A$146,\"\",IF(Zuschlag!AO58=0,\"\",Zuschlag!AO58))","v":""},{"$f":"IF(AO$48=Daten!$A$146,\"\",IF(Zuschlag!AP58=0,\"\",Zuschlag!AP58))","v":""},{"$f":"IF(AP$48=Daten!$A$146,\"\",IF(Zuschlag!AQ58=0,\"\",Zuschlag!AQ58))","v":""},{"$f":"IF(AQ$48=Daten!$A$146,\"\",IF(Zuschlag!AR58=0,\"\",Zuschlag!AR58))","v":""}]
[{"$f":"Zuschlag!A59","v":"8"},{"$f":"Zuschlag!B59","v":0},"","",{"$f":"IF(E$48=Daten!$A$146,\"\",IF(Zuschlag!F59=0,\"\",Zuschlag!F59))","v":""},{"$f":"IF(F$48=Daten!$A$146,\"\",IF(Zuschlag!G59=0,\"\",Zuschlag!G59))","v":""},{"$f":"IF(G$48=Daten!$A$146,\"\",IF(Zuschlag!H59=0,\"\",Zuschlag!H59))","v":""},{"$f":"IF(H$48=Daten!$A$146,\"\",IF(Zuschlag!I59=0,\"\",Zuschlag!I59))","v":""},{"$f":"IF(I$48=Daten!$A$146,\"\",IF(Zuschlag!J59=0,\"\",Zuschlag!J59))","v":""},{"$f":"IF(J$48=Daten!$A$146,\"\",IF(Zuschlag!K59=0,\"\",Zuschlag!K59))","v":""},{"$f":"IF(K$48=Daten!$A$146,\"\",IF(Zuschlag!L59=0,\"\",Zuschlag!L59))","v":""},{"$f":"IF(L$48=Daten!$A$146,\"\",IF(Zuschlag!M59=0,\"\",Zuschlag!M59))","v":""},{"$f":"IF(M$48=Daten!$A$146,\"\",IF(Zuschlag!N59=0,\"\",Zuschlag!N59))","v":""},{"$f":"IF(N$48=Daten!$A$146,\"\",IF(Zuschlag!O59=0,\"\",Zuschlag!O59))","v":""},{"$f":"IF(O$48=Daten!$A$146,\"\",IF(Zuschlag!P59=0,\"\",Zuschlag!P59))","v":""},{"$f":"IF(P$48=Daten!$A$146,\"\",IF(Zuschlag!Q59=0,\"\",Zuschlag!Q59))","v":""},{"$f":"IF(Q$48=Daten!$A$146,\"\",IF(Zuschlag!R59=0,\"\",Zuschlag!R59))","v":""},{"$f":"IF(R$48=Daten!$A$146,\"\",IF(Zuschlag!S59=0,\"\",Zuschlag!S59))","v":""},{"$f":"IF(S$48=Daten!$A$146,\"\",IF(Zuschlag!T59=0,\"\",Zuschlag!T59))","v":""},{"$f":"IF(T$48=Daten!$A$146,\"\",IF(Zuschlag!U59=0,\"\",Zuschlag!U59))","v":""},{"$f":"IF(U$48=Daten!$A$146,\"\",IF(Zuschlag!V59=0,\"\",Zuschlag!V59))","v":""},{"$f":"IF(V$48=Daten!$A$146,\"\",IF(Zuschlag!W59=0,\"\",Zuschlag!W59))","v":""},{"$f":"IF(W$48=Daten!$A$146,\"\",IF(Zuschlag!X59=0,\"\",Zuschlag!X59))","v":""},{"$f":"IF(X$48=Daten!$A$146,\"\",IF(Zuschlag!Y59=0,\"\",Zuschlag!Y59))","v":""},{"$f":"IF(Y$48=Daten!$A$146,\"\",IF(Zuschlag!Z59=0,\"\",Zuschlag!Z59))","v":""},{"$f":"IF(Z$48=Daten!$A$146,\"\",IF(Zuschlag!AA59=0,\"\",Zuschlag!AA59))","v":""},{"$f":"IF(AA$48=Daten!$A$146,\"\",IF(Zuschlag!AB59=0,\"\",Zuschlag!AB59))","v":""},{"$f":"IF(AB$48=Daten!$A$146,\"\",IF(Zuschlag!AC59=0,\"\",Zuschlag!AC59))","v":""},{"$f":"IF(AC$48=Daten!$A$146,\"\",IF(Zuschlag!AD59=0,\"\",Zuschlag!AD59))","v":""},{"$f":"IF(AD$48=Daten!$A$146,\"\",IF(Zuschlag!AE59=0,\"\",Zuschlag!AE59))","v":""},{"$f":"IF(AE$48=Daten!$A$146,\"\",IF(Zuschlag!AF59=0,\"\",Zuschlag!AF59))","v":""},{"$f":"IF(AF$48=Daten!$A$146,\"\",IF(Zuschlag!AG59=0,\"\",Zuschlag!AG59))","v":""},{"$f":"IF(AG$48=Daten!$A$146,\"\",IF(Zuschlag!AH59=0,\"\",Zuschlag!AH59))","v":""},{"$f":"IF(AH$48=Daten!$A$146,\"\",IF(Zuschlag!AI59=0,\"\",Zuschlag!AI59))","v":""},{"$f":"IF(AI$48=Daten!$A$146,\"\",IF(Zuschlag!AJ59=0,\"\",Zuschlag!AJ59))","v":""},{"$f":"IF(AJ$48=Daten!$A$146,\"\",IF(Zuschlag!AK59=0,\"\",Zuschlag!AK59))","v":""},{"$f":"IF(AK$48=Daten!$A$146,\"\",IF(Zuschlag!AL59=0,\"\",Zuschlag!AL59))","v":""},{"$f":"IF(AL$48=Daten!$A$146,\"\",IF(Zuschlag!AM59=0,\"\",Zuschlag!AM59))","v":""},{"$f":"IF(AM$48=Daten!$A$146,\"\",IF(Zuschlag!AN59=0,\"\",Zuschlag!AN59))","v":""},{"$f":"IF(AN$48=Daten!$A$146,\"\",IF(Zuschlag!AO59=0,\"\",Zuschlag!AO59))","v":""},{"$f":"IF(AO$48=Daten!$A$146,\"\",IF(Zuschlag!AP59=0,\"\",Zuschlag!AP59))","v":""},{"$f":"IF(AP$48=Daten!$A$146,\"\",IF(Zuschlag!AQ59=0,\"\",Zuschlag!AQ59))","v":""},{"$f":"IF(AQ$48=Daten!$A$146,\"\",IF(Zuschlag!AR59=0,\"\",Zuschlag!AR59))","v":""}]
[{"$f":"Zuschlag!A60","v":0},{"$f":"Zuschlag!B60","v":0},"","",{"$f":"IF(E$48=Daten!$A$146,\"\",IF(Zuschlag!F60=0,\"\",Zuschlag!F60))","v":""},{"$f":"IF(F$48=Daten!$A$146,\"\",IF(Zuschlag!G60=0,\"\",Zuschlag!G60))","v":""},{"$f":"IF(G$48=Daten!$A$146,\"\",IF(Zuschlag!H60=0,\"\",Zuschlag!H60))","v":""},{"$f":"IF(H$48=Daten!$A$146,\"\",IF(Zuschlag!I60=0,\"\",Zuschlag!I60))","v":""},{"$f":"IF(I$48=Daten!$A$146,\"\",IF(Zuschlag!J60=0,\"\",Zuschlag!J60))","v":""},{"$f":"IF(J$48=Daten!$A$146,\"\",IF(Zuschlag!K60=0,\"\",Zuschlag!K60))","v":""},{"$f":"IF(K$48=Daten!$A$146,\"\",IF(Zuschlag!L60=0,\"\",Zuschlag!L60))","v":""},{"$f":"IF(L$48=Daten!$A$146,\"\",IF(Zuschlag!M60=0,\"\",Zuschlag!M60))","v":""},{"$f":"IF(M$48=Daten!$A$146,\"\",IF(Zuschlag!N60=0,\"\",Zuschlag!N60))","v":""},{"$f":"IF(N$48=Daten!$A$146,\"\",IF(Zuschlag!O60=0,\"\",Zuschlag!O60))","v":""},{"$f":"IF(O$48=Daten!$A$146,\"\",IF(Zuschlag!P60=0,\"\",Zuschlag!P60))","v":""},{"$f":"IF(P$48=Daten!$A$146,\"\",IF(Zuschlag!Q60=0,\"\",Zuschlag!Q60))","v":""},{"$f":"IF(Q$48=Daten!$A$146,\"\",IF(Zuschlag!R60=0,\"\",Zuschlag!R60))","v":""},{"$f":"IF(R$48=Daten!$A$146,\"\",IF(Zuschlag!S60=0,\"\",Zuschlag!S60))","v":""},{"$f":"IF(S$48=Daten!$A$146,\"\",IF(Zuschlag!T60=0,\"\",Zuschlag!T60))","v":""},{"$f":"IF(T$48=Daten!$A$146,\"\",IF(Zuschlag!U60=0,\"\",Zuschlag!U60))","v":""},{"$f":"IF(U$48=Daten!$A$146,\"\",IF(Zuschlag!V60=0,\"\",Zuschlag!V60))","v":""},{"$f":"IF(V$48=Daten!$A$146,\"\",IF(Zuschlag!W60=0,\"\",Zuschlag!W60))","v":""},{"$f":"IF(W$48=Daten!$A$146,\"\",IF(Zuschlag!X60=0,\"\",Zuschlag!X60))","v":""},{"$f":"IF(X$48=Daten!$A$146,\"\",IF(Zuschlag!Y60=0,\"\",Zuschlag!Y60))","v":""},{"$f":"IF(Y$48=Daten!$A$146,\"\",IF(Zuschlag!Z60=0,\"\",Zuschlag!Z60))","v":""},{"$f":"IF(Z$48=Daten!$A$146,\"\",IF(Zuschlag!AA60=0,\"\",Zuschlag!AA60))","v":""},{"$f":"IF(AA$48=Daten!$A$146,\"\",IF(Zuschlag!AB60=0,\"\",Zuschlag!AB60))","v":""},{"$f":"IF(AB$48=Daten!$A$146,\"\",IF(Zuschlag!AC60=0,\"\",Zuschlag!AC60))","v":""},{"$f":"IF(AC$48=Daten!$A$146,\"\",IF(Zuschlag!AD60=0,\"\",Zuschlag!AD60))","v":""},{"$f":"IF(AD$48=Daten!$A$146,\"\",IF(Zuschlag!AE60=0,\"\",Zuschlag!AE60))","v":""},{"$f":"IF(AE$48=Daten!$A$146,\"\",IF(Zuschlag!AF60=0,\"\",Zuschlag!AF60))","v":""},{"$f":"IF(AF$48=Daten!$A$146,\"\",IF(Zuschlag!AG60=0,\"\",Zuschlag!AG60))","v":""},{"$f":"IF(AG$48=Daten!$A$146,\"\",IF(Zuschlag!AH60=0,\"\",Zuschlag!AH60))","v":""},{"$f":"IF(AH$48=Daten!$A$146,\"\",IF(Zuschlag!AI60=0,\"\",Zuschlag!AI60))","v":""},{"$f":"IF(AI$48=Daten!$A$146,\"\",IF(Zuschlag!AJ60=0,\"\",Zuschlag!AJ60))","v":""},{"$f":"IF(AJ$48=Daten!$A$146,\"\",IF(Zuschlag!AK60=0,\"\",Zuschlag!AK60))","v":""},{"$f":"IF(AK$48=Daten!$A$146,\"\",IF(Zuschlag!AL60=0,\"\",Zuschlag!AL60))","v":""},{"$f":"IF(AL$48=Daten!$A$146,\"\",IF(Zuschlag!AM60=0,\"\",Zuschlag!AM60))","v":""},{"$f":"IF(AM$48=Daten!$A$146,\"\",IF(Zuschlag!AN60=0,\"\",Zuschlag!AN60))","v":""},{"$f":"IF(AN$48=Daten!$A$146,\"\",IF(Zuschlag!AO60=0,\"\",Zuschlag!AO60))","v":""},{"$f":"IF(AO$48=Daten!$A$146,\"\",IF(Zuschlag!AP60=0,\"\",Zuschlag!AP60))","v":""},{"$f":"IF(AP$48=Daten!$A$146,\"\",IF(Zuschlag!AQ60=0,\"\",Zuschlag!AQ60))","v":""},{"$f":"IF(AQ$48=Daten!$A$146,\"\",IF(Zuschlag!AR60=0,\"\",Zuschlag!AR60))","v":""}]
[{"$f":"Zuschlag!A61","v":"8.1"},{"$f":"Zuschlag!B61","v":0},"","",{"$f":"IF(E$48=Daten!$A$146,\"\",IF(Zuschlag!F61=0,\"\",Zuschlag!F61))","v":""},{"$f":"IF(F$48=Daten!$A$146,\"\",IF(Zuschlag!G61=0,\"\",Zuschlag!G61))","v":""},{"$f":"IF(G$48=Daten!$A$146,\"\",IF(Zuschlag!H61=0,\"\",Zuschlag!H61))","v":""},{"$f":"IF(H$48=Daten!$A$146,\"\",IF(Zuschlag!I61=0,\"\",Zuschlag!I61))","v":""},{"$f":"IF(I$48=Daten!$A$146,\"\",IF(Zuschlag!J61=0,\"\",Zuschlag!J61))","v":""},{"$f":"IF(J$48=Daten!$A$146,\"\",IF(Zuschlag!K61=0,\"\",Zuschlag!K61))","v":""},{"$f":"IF(K$48=Daten!$A$146,\"\",IF(Zuschlag!L61=0,\"\",Zuschlag!L61))","v":""},{"$f":"IF(L$48=Daten!$A$146,\"\",IF(Zuschlag!M61=0,\"\",Zuschlag!M61))","v":""},{"$f":"IF(M$48=Daten!$A$146,\"\",IF(Zuschlag!N61=0,\"\",Zuschlag!N61))","v":""},{"$f":"IF(N$48=Daten!$A$146,\"\",IF(Zuschlag!O61=0,\"\",Zuschlag!O61))","v":""},{"$f":"IF(O$48=Daten!$A$146,\"\",IF(Zuschlag!P61=0,\"\",Zuschlag!P61))","v":""},{"$f":"IF(P$48=Daten!$A$146,\"\",IF(Zuschlag!Q61=0,\"\",Zuschlag!Q61))","v":""},{"$f":"IF(Q$48=Daten!$A$146,\"\",IF(Zuschlag!R61=0,\"\",Zuschlag!R61))","v":""},{"$f":"IF(R$48=Daten!$A$146,\"\",IF(Zuschlag!S61=0,\"\",Zuschlag!S61))","v":""},{"$f":"IF(S$48=Daten!$A$146,\"\",IF(Zuschlag!T61=0,\"\",Zuschlag!T61))","v":""},{"$f":"IF(T$48=Daten!$A$146,\"\",IF(Zuschlag!U61=0,\"\",Zuschlag!U61))","v":""},{"$f":"IF(U$48=Daten!$A$146,\"\",IF(Zuschlag!V61=0,\"\",Zuschlag!V61))","v":""},{"$f":"IF(V$48=Daten!$A$146,\"\",IF(Zuschlag!W61=0,\"\",Zuschlag!W61))","v":""},{"$f":"IF(W$48=Daten!$A$146,\"\",IF(Zuschlag!X61=0,\"\",Zuschlag!X61))","v":""},{"$f":"IF(X$48=Daten!$A$146,\"\",IF(Zuschlag!Y61=0,\"\",Zuschlag!Y61))","v":""},{"$f":"IF(Y$48=Daten!$A$146,\"\",IF(Zuschlag!Z61=0,\"\",Zuschlag!Z61))","v":""},{"$f":"IF(Z$48=Daten!$A$146,\"\",IF(Zuschlag!AA61=0,\"\",Zuschlag!AA61))","v":""},{"$f":"IF(AA$48=Daten!$A$146,\"\",IF(Zuschlag!AB61=0,\"\",Zuschlag!AB61))","v":""},{"$f":"IF(AB$48=Daten!$A$146,\"\",IF(Zuschlag!AC61=0,\"\",Zuschlag!AC61))","v":""},{"$f":"IF(AC$48=Daten!$A$146,\"\",IF(Zuschlag!AD61=0,\"\",Zuschlag!AD61))","v":""},{"$f":"IF(AD$48=Daten!$A$146,\"\",IF(Zuschlag!AE61=0,\"\",Zuschlag!AE61))","v":""},{"$f":"IF(AE$48=Daten!$A$146,\"\",IF(Zuschlag!AF61=0,\"\",Zuschlag!AF61))","v":""},{"$f":"IF(AF$48=Daten!$A$146,\"\",IF(Zuschlag!AG61=0,\"\",Zuschlag!AG61))","v":""},{"$f":"IF(AG$48=Daten!$A$146,\"\",IF(Zuschlag!AH61=0,\"\",Zuschlag!AH61))","v":""},{"$f":"IF(AH$48=Daten!$A$146,\"\",IF(Zuschlag!AI61=0,\"\",Zuschlag!AI61))","v":""},{"$f":"IF(AI$48=Daten!$A$146,\"\",IF(Zuschlag!AJ61=0,\"\",Zuschlag!AJ61))","v":""},{"$f":"IF(AJ$48=Daten!$A$146,\"\",IF(Zuschlag!AK61=0,\"\",Zuschlag!AK61))","v":""},{"$f":"IF(AK$48=Daten!$A$146,\"\",IF(Zuschlag!AL61=0,\"\",Zuschlag!AL61))","v":""},{"$f":"IF(AL$48=Daten!$A$146,\"\",IF(Zuschlag!AM61=0,\"\",Zuschlag!AM61))","v":""},{"$f":"IF(AM$48=Daten!$A$146,\"\",IF(Zuschlag!AN61=0,\"\",Zuschlag!AN61))","v":""},{"$f":"IF(AN$48=Daten!$A$146,\"\",IF(Zuschlag!AO61=0,\"\",Zuschlag!AO61))","v":""},{"$f":"IF(AO$48=Daten!$A$146,\"\",IF(Zuschlag!AP61=0,\"\",Zuschlag!AP61))","v":""},{"$f":"IF(AP$48=Daten!$A$146,\"\",IF(Zuschlag!AQ61=0,\"\",Zuschlag!AQ61))","v":""},{"$f":"IF(AQ$48=Daten!$A$146,\"\",IF(Zuschlag!AR61=0,\"\",Zuschlag!AR61))","v":""}]
[{"$f":"Zuschlag!A62","v":"8.2"},{"$f":"Zuschlag!B62","v":0},"","",{"$f":"IF(E$48=Daten!$A$146,\"\",IF(Zuschlag!F62=0,\"\",Zuschlag!F62))","v":""},{"$f":"IF(F$48=Daten!$A$146,\"\",IF(Zuschlag!G62=0,\"\",Zuschlag!G62))","v":""},{"$f":"IF(G$48=Daten!$A$146,\"\",IF(Zuschlag!H62=0,\"\",Zuschlag!H62))","v":""},{"$f":"IF(H$48=Daten!$A$146,\"\",IF(Zuschlag!I62=0,\"\",Zuschlag!I62))","v":""},{"$f":"IF(I$48=Daten!$A$146,\"\",IF(Zuschlag!J62=0,\"\",Zuschlag!J62))","v":""},{"$f":"IF(J$48=Daten!$A$146,\"\",IF(Zuschlag!K62=0,\"\",Zuschlag!K62))","v":""},{"$f":"IF(K$48=Daten!$A$146,\"\",IF(Zuschlag!L62=0,\"\",Zuschlag!L62))","v":""},{"$f":"IF(L$48=Daten!$A$146,\"\",IF(Zuschlag!M62=0,\"\",Zuschlag!M62))","v":""},{"$f":"IF(M$48=Daten!$A$146,\"\",IF(Zuschlag!N62=0,\"\",Zuschlag!N62))","v":""},{"$f":"IF(N$48=Daten!$A$146,\"\",IF(Zuschlag!O62=0,\"\",Zuschlag!O62))","v":""},{"$f":"IF(O$48=Daten!$A$146,\"\",IF(Zuschlag!P62=0,\"\",Zuschlag!P62))","v":""},{"$f":"IF(P$48=Daten!$A$146,\"\",IF(Zuschlag!Q62=0,\"\",Zuschlag!Q62))","v":""},{"$f":"IF(Q$48=Daten!$A$146,\"\",IF(Zuschlag!R62=0,\"\",Zuschlag!R62))","v":""},{"$f":"IF(R$48=Daten!$A$146,\"\",IF(Zuschlag!S62=0,\"\",Zuschlag!S62))","v":""},{"$f":"IF(S$48=Daten!$A$146,\"\",IF(Zuschlag!T62=0,\"\",Zuschlag!T62))","v":""},{"$f":"IF(T$48=Daten!$A$146,\"\",IF(Zuschlag!U62=0,\"\",Zuschlag!U62))","v":""},{"$f":"IF(U$48=Daten!$A$146,\"\",IF(Zuschlag!V62=0,\"\",Zuschlag!V62))","v":""},{"$f":"IF(V$48=Daten!$A$146,\"\",IF(Zuschlag!W62=0,\"\",Zuschlag!W62))","v":""},{"$f":"IF(W$48=Daten!$A$146,\"\",IF(Zuschlag!X62=0,\"\",Zuschlag!X62))","v":""},{"$f":"IF(X$48=Daten!$A$146,\"\",IF(Zuschlag!Y62=0,\"\",Zuschlag!Y62))","v":""},{"$f":"IF(Y$48=Daten!$A$146,\"\",IF(Zuschlag!Z62=0,\"\",Zuschlag!Z62))","v":""},{"$f":"IF(Z$48=Daten!$A$146,\"\",IF(Zuschlag!AA62=0,\"\",Zuschlag!AA62))","v":""},{"$f":"IF(AA$48=Daten!$A$146,\"\",IF(Zuschlag!AB62=0,\"\",Zuschlag!AB62))","v":""},{"$f":"IF(AB$48=Daten!$A$146,\"\",IF(Zuschlag!AC62=0,\"\",Zuschlag!AC62))","v":""},{"$f":"IF(AC$48=Daten!$A$146,\"\",IF(Zuschlag!AD62=0,\"\",Zuschlag!AD62))","v":""},{"$f":"IF(AD$48=Daten!$A$146,\"\",IF(Zuschlag!AE62=0,\"\",Zuschlag!AE62))","v":""},{"$f":"IF(AE$48=Daten!$A$146,\"\",IF(Zuschlag!AF62=0,\"\",Zuschlag!AF62))","v":""},{"$f":"IF(AF$48=Daten!$A$146,\"\",IF(Zuschlag!AG62=0,\"\",Zuschlag!AG62))","v":""},{"$f":"IF(AG$48=Daten!$A$146,\"\",IF(Zuschlag!AH62=0,\"\",Zuschlag!AH62))","v":""},{"$f":"IF(AH$48=Daten!$A$146,\"\",IF(Zuschlag!AI62=0,\"\",Zuschlag!AI62))","v":""},{"$f":"IF(AI$48=Daten!$A$146,\"\",IF(Zuschlag!AJ62=0,\"\",Zuschlag!AJ62))","v":""},{"$f":"IF(AJ$48=Daten!$A$146,\"\",IF(Zuschlag!AK62=0,\"\",Zuschlag!AK62))","v":""},{"$f":"IF(AK$48=Daten!$A$146,\"\",IF(Zuschlag!AL62=0,\"\",Zuschlag!AL62))","v":""},{"$f":"IF(AL$48=Daten!$A$146,\"\",IF(Zuschlag!AM62=0,\"\",Zuschlag!AM62))","v":""},{"$f":"IF(AM$48=Daten!$A$146,\"\",IF(Zuschlag!AN62=0,\"\",Zuschlag!AN62))","v":""},{"$f":"IF(AN$48=Daten!$A$146,\"\",IF(Zuschlag!AO62=0,\"\",Zuschlag!AO62))","v":""},{"$f":"IF(AO$48=Daten!$A$146,\"\",IF(Zuschlag!AP62=0,\"\",Zuschlag!AP62))","v":""},{"$f":"IF(AP$48=Daten!$A$146,\"\",IF(Zuschlag!AQ62=0,\"\",Zuschlag!AQ62))","v":""},{"$f":"IF(AQ$48=Daten!$A$146,\"\",IF(Zuschlag!AR62=0,\"\",Zuschlag!AR62))","v":""}]
[{"$nulls":4},{"$f":"Zuschlag!E63","v":""},{"$f":"Zuschlag!F63","v":0},{"$f":"Zuschlag!G63","v":""},{"$f":"Zuschlag!H63","v":0},{"$f":"Zuschlag!I63","v":""},{"$f":"Zuschlag!J63","v":0},{"$f":"Zuschlag!K63","v":""},{"$f":"Zuschlag!L63","v":0},{"$f":"Zuschlag!M63","v":""},{"$f":"Zuschlag!N63","v":0},{"$f":"Zuschlag!O63","v":""},{"$f":"Zuschlag!P63","v":0},{"$f":"Zuschlag!Q63","v":""},{"$f":"Zuschlag!R63","v":0},{"$f":"Zuschlag!S63","v":""},{"$f":"Zuschlag!T63","v":0},{"$f":"Zuschlag!U63","v":""},{"$f":"Zuschlag!V63","v":0},{"$f":"Zuschlag!W63","v":""},{"$f":"Zuschlag!X63","v":0},{"$f":"Zuschlag!Y63","v":""},{"$f":"Zuschlag!Z63","v":0},{"$f":"Zuschlag!AA63","v":""},{"$f":"Zuschlag!AB63","v":0},{"$f":"Zuschlag!AC63","v":""},{"$f":"Zuschlag!AD63","v":0},{"$f":"Zuschlag!AE63","v":""},{"$f":"Zuschlag!AF63","v":0},{"$f":"Zuschlag!AG63","v":""},{"$f":"Zuschlag!AH63","v":0},{"$f":"Zuschlag!AI63","v":""},{"$f":"Zuschlag!AJ63","v":0},{"$f":"Zuschlag!AK63","v":""},{"$f":"Zuschlag!AL63","v":0},{"$f":"Zuschlag!AM63","v":""},{"$f":"Zuschlag!AN63","v":0},{"$f":"Zuschlag!AO63","v":""},{"$f":"Zuschlag!AP63","v":0},{"$f":"Zuschlag!AQ63","v":""}]
[]
[{"$nulls":4},{"$f":"Zuschlag!E13","v":""},{"$f":"Zuschlag!F13","v":0},{"$f":"Zuschlag!G13","v":""},{"$f":"Zuschlag!H13","v":0},{"$f":"Zuschlag!I13","v":""},{"$f":"Zuschlag!J13","v":0},{"$f":"Zuschlag!K13","v":""},{"$f":"Zuschlag!L13","v":0},{"$f":"Zuschlag!M13","v":""},{"$f":"Zuschlag!N13","v":0},{"$f":"Zuschlag!O13","v":""},{"$f":"Zuschlag!P13","v":0},{"$f":"Zuschlag!Q13","v":""},{"$f":"Zuschlag!R13","v":0},{"$f":"Zuschlag!S13","v":""},{"$f":"Zuschlag!T13","v":0},{"$f":"Zuschlag!U13","v":""},{"$f":"Zuschlag!V13","v":0},{"$f":"Zuschlag!W13","v":""},{"$f":"Zuschlag!X13","v":0},{"$f":"Zuschlag!Y13","v":""},{"$f":"Zuschlag!Z13","v":0},{"$f":"Zuschlag!AA13","v":""},{"$f":"Zuschlag!AB13","v":0},{"$f":"Zuschlag!AC13","v":""},{"$f":"Zuschlag!AD13","v":0},{"$f":"Zuschlag!AE13","v":""},{"$f":"Zuschlag!AF13","v":0},{"$f":"Zuschlag!AG13","v":""},{"$f":"Zuschlag!AH13","v":0},{"$f":"Zuschlag!AI13","v":""},{"$f":"Zuschlag!AJ13","v":0},{"$f":"Zuschlag!AK13","v":""},{"$f":"Zuschlag!AL13","v":0},{"$f":"Zuschlag!AM13","v":""},{"$f":"Zuschlag!AN13","v":0},{"$f":"Zuschlag!AO13","v":""},{"$f":"Zuschlag!AP13","v":0},{"$f":"Zuschlag!AQ13","v":""}]

{"sheet":"Daten","index":13,"n_rows":184,"n_cols":5,"rows_kept":184,"cut":false,"hidden":true,"merged":[]}
[{"$f":"Info!P4","v":"deutsch"},"<-- wird von Info-Seite übernommen"]
[]
["Sprachwahl","√"]
["deutsch","X"]
["français"]
["italiano"]
[]
[]
["Hilfstexte"]
[{"$f":"IF($A$1=\"deutsch\",C10,IF($A$1=\"français\",D10,IF($A$1=\"italiano\",E10)))","v":"Kopfzeile bearbeiten"},"Titelblatt","Kopfzeile bearbeiten","créer l'en-tête ","creare l'intestazione"]
[]
[{"$f":"IF($A$1=\"deutsch\",C12,IF($A$1=\"français\",D12,IF($A$1=\"italiano\",E12)))","v":"Informationen zum Ausfüllen des Formulars (wird nicht gedruckt)"},"Info, Einstellungstext","Informationen zum Ausfüllen des Formulars (wird nicht gedruckt)","Instructions pour remplir le formulaire (ne seront pas imprimées)","Informazioni sulla compilazione del modulo (non viene stampato)"]
[{"$f":"IF($A$1=\"deutsch\",C13,IF($A$1=\"français\",D13,IF($A$1=\"italiano\",E13)))","v":"Bearbeitbare Zellen im Dokument kennzeichnen"},"Info, Einstellungstext","Bearbeitbare Zellen im Dokument kennzeichnen","Marquer les cellules modifiables dans le formulaire","Evidenziare le celle modificabili nel modulo"]
[{"$f":"IF($A$1=\"deutsch\",C14,IF($A$1=\"français\",D14,IF($A$1=\"italiano\",E14)))","v":"Bearbeitbare Zellen im Dokument NICHT kennzeichnen"},"Info, Einstellungstext","Bearbeitbare Zellen im Dokument NICHT kennzeichnen","Désactiver le marquage des cellules modifiables dans le formulaire","NON evidenziare le celle modificabili nel modulo"]
[{"$f":"IF($A$1=\"deutsch\",C15,IF($A$1=\"français\",D15,IF($A$1=\"italiano\",E15)))","v":"Die bearbeitbaren Zellen werden hellgrau gekennzeichnet, damit klar ersichtlich ist, wo gegebenenfalls Eingaben zu machen sind."},"Info, Einstellungstext","Die bearbeitbaren Zellen werden hellgrau gekennzeichnet, damit klar ersichtlich ist, wo gegebenenfalls Eingaben zu machen sind.","Les cellules modifiables apparaîtront en gris clair. Les champs où il faut saisir des données apparaissent ainsi clairement.","Le celle modificabili vengono evidenziate in grigio chiaro affinché i campi da compilare siano facilmente riconoscibili."]
[{"$f":"IF($A$1=\"deutsch\",C16,IF($A$1=\"français\",D16,IF($A$1=\"italiano\",E16)))","v":"Die bearbeitbaren Zellen werden nicht mehr hellgrau gekennzeichnet; optimal für den Ausdruck."},"Info, Einstellungstext","Die bearbeitbaren Zellen werden nicht mehr hellgrau gekennzeichnet; optimal für den Ausdruck.","Les cellules modifiables apparaîtront comme le reste du document à l’impression.","Le celle modificabili non vengono più evidenziate in grigio chiaro per ottimizzare la stampa."]
[]
[{"$f":"IF($A$1=\"deutsch\",C18,IF($A$1=\"français\",D18,IF($A$1=\"italiano\",E18)))","v":"Vorzeichen beachten: Wenn Betrag abgezogen werden soll ein \" - \" (Minus) als Vorzeichen verwenden. Eingabe z.B. -1000"},"Kosten, Hilfetext","Vorzeichen beachten: Wenn Betrag abgezogen werden soll ein \" - \" (Minus) als Vorzeichen verwenden. Eingabe z.B. -1000","Attention aux signes: Si un montant doit être déduit, utilier le signe \" - \" (moins). Par ex.: -1000","Attenzione ai segni: Se un importo deve essere dedotto, utilizzare il segno \" - \" (meno). Introdurre ad esempio: -1000"]
[{"$f":"IF($A$1=\"deutsch\",C19,IF($A$1=\"français\",D19,IF($A$1=\"italiano\",E19)))","v":"Die Kriterien sind mit √ (ja) oder X (nein) zu bewerten. \n\nDie Kriterien können mittels Dropdownmenü ausgewählt werden.\n\nUm eine Eingabe zu löschen, einfach das Feld markieren und \"Delete\" drücken.\n\nFalls ein Anbieter als Bewertung ein X erhält, wird er von der weiteren Bewertung ausgeschlossen!"},"Formell, Hilfetext","Die Kriterien sind mit √ (ja) oder X (nein) zu bewerten. \n\nDie Kriterien können mittels Dropdownmenü ausgewählt werden.\n\nUm eine Eingabe zu löschen, einfach das Feld markieren und \"Delete\" drücken.\n\nFalls ein Anbieter als Bewertung ein X erhält, wird er von der weiteren Bewertung ausgeschlossen!","Les critères doivent être évalués par √ (oui) ou X (non).\n\nLes critères peuvent être choisis par le biais du \"Dropdownmenu\". \n\nPour effacer une donnée mette le champ en surbrillance et presser \"Delete\".\n\nSi un mandataire reçoit un X comme évaluation, il est exclu de la suite de l'évaluation.","I criteri devono essere valutati con un √ (si) o con un X (no).\n\nI criteri possono essere scelti tramite \"Dropdownmenu\".\n\nPer cancellare un dato, tracciare la casella e premere il tasto \"Delete\".\n\nSe un mandatario nella valutazione riceve un X, viene escluso dalle valutazioni seguenti."]
[]
[{"$f":"IF($A$1=\"deutsch\",C21,IF($A$1=\"français\",D21,IF($A$1=\"italiano\",E21)))","v":"Die Spalte \"Kurzbezeichnung Firma\" muss unbedingt ausgefüllt werden, da diese Bezeichnung der Firma in allen weiteren Blättern verwerndet wird."},null,"Die Spalte \"Kurzbezeichnung Firma\" muss unbedingt ausgefüllt werden, da diese Bezeichnung der Firma in allen weiteren Blättern verwerndet wird.","La colonne \"Abréviation de l'entreprise\" doit être remplie, car ce nom d l'entreprise sera utilisé dans toutes les autres fiches.","La colonna “Breve designazione della ditta” deve essere compilata, poiché questo nome della ditta sarà usato in tutti i fogli successivi."]
[]
[{"$f":"IF($A$1=\"deutsch\",C23,IF($A$1=\"français\",D23,IF($A$1=\"italiano\",E23)))","v":"ja"},"Diverse","ja","oui","si"]
[{"$f":"IF($A$1=\"deutsch\",C24,IF($A$1=\"français\",D24,IF($A$1=\"italiano\",E24)))","v":"nein"},"Diverse","nein","non","no"]
[]
[{"$f":"IF($A$1=\"deutsch\",C26,IF($A$1=\"français\",D26,IF($A$1=\"italiano\",E26)))","v":"Projektleiter"},"Antrag","Projektleiter","Chef de projet","Capoprogetto"]
[]
[{"$f":"IF($A$1=\"deutsch\",C28,IF($A$1=\"français\",D28,IF($A$1=\"italiano\",E28)))","v":"unge-nügend"},"Gesamt","unge-nügend","insuffi-sant","insuffi-ciente"]
[{"$f":"IF($A$1=\"deutsch\",C29,IF($A$1=\"français\",D29,IF($A$1=\"italiano\",E29)))","v":"Projektinformationen"},"Diverse","Projektinformationen","Informations sur les projets","Informazioni sui progetti"]
[{"$f":"IF($A$1=\"deutsch\",C30,IF($A$1=\"français\",D30,IF($A$1=\"italiano\",E30)))","v":"Antrag"},"Diverse","Antrag","Proposition","Proposta"]
[{"$f":"IF($A$1=\"deutsch\",C31,IF($A$1=\"français\",D31,IF($A$1=\"italiano\",E31)))","v":"Offertöffnungsprotokoll"},"Diverse","Offertöffnungsprotokoll","Procès-verbal d'ouverture des offres","Processo verbale d'apertura delle offerte"]
["Formelle Prüfung","Diverse","Formelle Prüfung","Examen formel","Verifica formale"]
["Eignungsprüfung","Diverse","Eignungsprüfung","Evaluation de la qualification","Esame d'idoneità"]
["Prüfung der Zuschlagskriterien","Diverse","Prüfung der Zuschlagskriterien","Evaluation des critères d'adjudication","Verifica dei criteri di aggiudicazione"]
["Bemerkungen Zuschlag",null,"Bemerkungen Zuschlag","Remarques adjudication","Commenti aggiudicazione"]
["Bereinigung der Kosten","Diverse","Bereinigung der Kosten","Révision des coûts","Revisione dei costi"]
[{"$f":"IF($A$1=\"deutsch\",C37,IF($A$1=\"français\",D37,IF($A$1=\"italiano\",E37)))","v":"Projektnummer"},"Information","Projektnummer","N° du projet","N° del progetto"]
["Projektbezeichnung","Information","Projektbezeichnung","Désignation du projet","Designazione del progetto"]
["Auftragsnummer","Information","Auftragsnummer","N° d'ordre","N° del mandato"]
["Vertragsgegenstand","Information","Vertragsgegenstand","Objet du contrat","Oggetto del contratto"]
["Organisationseinheit","Information","Organisationseinheit","Unité d'organisation","Unità d'organizzazione"]
["Vertragsbeginn / -ende","Information","Vertragsbeginn / -ende","Début et fin du contrat","Inizio / fine del contratto"]
["Projektleiter Bauherr","Information","Projektleiter Bauherr","Chef de projet du maître de l'ouvrage","Capo progetto del comittente"]
["Verfasser Ausschreibung","Information","Verfasser Ausschreibung","Auteur de l'appel d'offres","Autore messa a concorso"]
[{"$f":"IF($A$1=\"deutsch\",C45,IF($A$1=\"français\",D45,IF($A$1=\"italiano\",E45)))","v":"Projektleiter Bauherr"},"Information","Projektleiter Bauherr","Chef de projet du maître de l'ouvrage","Capo progetto del comittente"]
[{"$f":"IF($A$1=\"deutsch\",C46,IF($A$1=\"français\",D46,IF($A$1=\"italiano\",E46)))","v":"Vertragspartner"},"Information","Vertragspartner","Partenaire contractuel","Parte contraente"]
[{"$f":"IF($A$1=\"deutsch\",C47,IF($A$1=\"français\",D47,IF($A$1=\"italiano\",E47)))","v":"Der Vergabe entsprechender KV"},"Antrag","Der Vergabe entsprechender KV","Devis correspondant à l'adjudication","Preventivo corrispondente alla delibera"]
[{"$f":"IF($A$1=\"deutsch\",C48,IF($A$1=\"français\",D48,IF($A$1=\"italiano\",E48)))","v":"Vergabeverfahren"},"Information","Vergabeverfahren","Procédure d’adjudication","Procedura di delibera"]
[{"$f":"IF($A$1=\"deutsch\",C49,IF($A$1=\"français\",D49,IF($A$1=\"italiano\",E49)))","v":"Datum Ausschreibung"},"Information","Datum Ausschreibung","Date de la mise en soumission","Date della messa in offerta"]
[{"$f":"IF($A$1=\"deutsch\",C50,IF($A$1=\"français\",D50,IF($A$1=\"italiano\",E50)))","v":"Eingabedatum Angebot"},"Information","Eingabedatum Angebot","Date limite de dépôt des offres","Data di inoltro dell'offerta"]
[{"$f":"IF($A$1=\"deutsch\",C51,IF($A$1=\"français\",D51,IF($A$1=\"italiano\",E51)))","v":"Begründung für freihändiges Verfahren"},"Information","Begründung für freihändiges Verfahren","Justification de la procédure de gré à gré","Motivazione per procedura in via amichevole"]
[]
[{"$f":"IF($A$1=\"deutsch\",C53,IF($A$1=\"français\",D53,IF($A$1=\"italiano\",E53)))","v":"Einladungsverfahren"},"Information","Einladungsverfahren","Procédure invitant à soumissionner","Procedura invito da offrire"]
[{"$f":"IF($A$1=\"deutsch\",C54,IF($A$1=\"français\",D54,IF($A$1=\"italiano\",E54)))","v":"Offenes Verfahren"},"Information","Offenes Verfahren","Procédure ouverte","Procedura aperta"]
[{"$f":"IF($A$1=\"deutsch\",C55,IF($A$1=\"français\",D55,IF($A$1=\"italiano\",E55)))","v":"Selektives Verfahren"},"Information","Selektives Verfahren","Procédure sélective","Procedura selettiva"]
[{"$f":"IF($A$1=\"deutsch\",C56,IF($A$1=\"français\",D56,IF($A$1=\"italiano\",E56)))","v":"Freihändiges Verfahren"},"Information","Freihändiges Verfahren","Procédure de gré à gré","Procedura a trattativa privata"]
[]
[{"$f":"IF($A$1=\"deutsch\",C58,IF($A$1=\"français\",D58,IF($A$1=\"italiano\",E58)))","v":"a. Kein Angebot im OV/SV"},"Information","a. Kein Angebot im OV/SV","a. Pas d'offre dans la procédure ouv/sel","a. Nessuna offerta in OV/SV"]
["b. Abgestimmte Angebote","Information","b. Abgestimmte Angebote","b. Offres concertées","b. Offerte concertate"]
["c. Geistiges Eigentum","Information","c. Geistiges Eigentum","c. Propriété intellectuelle","c. Proprietà intellettuale"]
["d. Unvorhers. Ereignisse","Information","d. Unvorhers. Ereignisse","d. Evénements imprévus","d. Evente imprevisti"]
["e. Dringende Ergänzung","Information","e. Dringende Ergänzung","e. Complément urgent","e. Aggiunta urgente"]
["f. Kompatible Ergänzung","Information","f. Kompatible Ergänzung","f. Complément compatible","f. Aggiunta compatibile"]
["g. Prototyp","Information","g. Prototyp","g. Prototype","g. Prototipo"]
["h. Angekündigt. Folgeauftrag","Information","h. Angekündigt. Folgeauftrag","h. Mandat consécutif annoncé","h. Mandato consecutivo annunciato"]
["i. Warenbörse","Information","i. Warenbörse","i. Bourse de produits ","i.  Borsa dei prodotti"]
["k. Liquidationsverkauf","Information","k. Liquidationsverkauf","k. Liquidation-vente","k. Liquidazione-vendita"]
[{"$f":"IF($A$1=\"deutsch\",C68,IF($A$1=\"français\",D68,IF($A$1=\"italiano\",E68)))","v":0}]
[{"$f":"IF($A$1=\"deutsch\",C69,IF($A$1=\"français\",D69,IF($A$1=\"italiano\",E69)))","v":"Bemerkungen"},"Information","Bemerkungen","Remarques","Osservazioni"]
["Tage","Information","Tage","Jours","Giorni"]
["Zahlungsbedingungen (Tage/Skonto)","Information","Zahlungsbedingungen (Tage/Skonto)","Conditions de payment (Jours/escopmte)","Condizioni di pagamento (giorni/sconto)"]
["Kreditorennummer","Information","Kreditorennummer","N° du créditeur","N° del creditore"]
[0]
["Ausgangslage","Antrag","Ausgangslage","Situation initiale","Premessa"]
["Projektinformationen","Diverse","Projektinformationen","Informations sur les projets","Informazioni sui progetti"]
["Vergabeverfahren","Antrag","Vergabeverfahren","Procédure d'adjudication","Procedura di delibera"]
["Vergabesumme (Rundung: CHF 0.05)","Antrag","Vergabesumme (Rundung: CHF 0.05)","Montant d'adjudication (arrondissement: CHF 0.05)","Ammontare della delibera (arrotondamento: CHF 0.05)"]
["Gesamtbewertung","Antrag","Gesamtbewertung","Évaluation globale","Valutazione complessiva"]
["Vergabeantrag","Antrag","Vergabeantrag","Proposition d'adjudication","Proposta di delibera"]
["Aufgrund der besten Gesamt-\nwirtschaftlichkeit beantragen wir\ndie Vergabe an die Firma/ARGE:","Antrag","Aufgrund der besten Gesamt-\nwirtschaftlichkeit beantragen wir\ndie Vergabe an die Firma/ARGE:","Pour des raisons de rentabilité globale,\nnous proposons d'adjuger le marché à l'entreprise/le consortium:","In base alla migliore efficienza economica globale, proponiamo la delibera alla ditta/ARGE:"]
["Datum/Unterschrift:","Antrag","Datum/Unterschrift:","Date/Signature:","Data/Firma:"]
["Genehmigung","Antrag","Genehmigung","Approbation","Approvazione"]
["Vertrag geprüft","Antrag","Vertrag geprüft","Contrat vérifié","Presa verficato del contrato"]
["Vergabeantrag geprüft","Antrag","Vergabeantrag geprüft"," prop. d'adj. vérifié","Presa verficato Prop. di del."]
["Stellungnahme","Antrag","Stellungnahme","Prise de position","Prise de position"]
["Name + Funktion","Antrag","Name + Funktion","Nom + fonction","Nome + funzione"]
[]
[{"$f":"IF($A$1=\"deutsch\",C88,IF($A$1=\"français\",D88,IF($A$1=\"italiano\",E88)))","v":"Datum der Offertöffnung"},"Offertöffnung","Datum der Offertöffnung","Date de l'ouverture des offres","Data d'apertura delle offerte"]
["Anwesende Vertreter des Bauherrn","Offertöffnung","Anwesende Vertreter des Bauherrn","Représentants du maître d'ouvrage présent","Rappresentanti del appaltatore presenti"]
["Nr.","Offertöffnung","Nr.","N°","N°"]
["Anbieter / ARGE / INGE","Offertöffnung","Anbieter / ARGE / INGE","Soumissionnaire / consortium","Offerente / ARGE / INGE"]
["Bezeichnung","Offertöffnung","Bezeichnung","Désignation","Designazione"]
["Strasse / Nr.","Offertöffnung","Strasse / Nr.","Rue / N°","Via / N°"]
[]
[{"$f":"IF($A$1=\"deutsch\",C95,IF($A$1=\"français\",D95,IF($A$1=\"italiano\",E95)))","v":"PLZ"},"Offertöffnung","PLZ","NPA","NPA"]
["Ort","Offertöffnung","Ort","Localité","Luogo"]
["Name Verantw. Offerte","Offertöffnung","Name Verantw. Offerte","Nom du responsable de l'offre","Nome responsabile d'offerta"]
["Unbedingt ausfüllen!","Offertöffnung","Unbedingt ausfüllen!","Toujours  remplir!","Compilare in ogni caso!"]
["Kurzbe-zeichnung Firma","Offertöffnung","Kurzbe-zeichnung Firma","Abréviation de l'entre-prise","Breve desi-\ngnazione della ditta"]
["Datum Eingabe","Offertöffnung","Datum Eingabe","Date de dé-pôt de l'offre","Data della domanda"]
["(Poststempel, Eingangs-stempel)","Offertöffnung","(Poststempel, Eingangs-stempel)","(timbre postal, timbre réception)","(timbro postale, timbratura d'arrivo)"]
["Eingabe brutto","Offertöffnung","Eingabe brutto","Offre brute","Domanda lordo"]
["CHF\n(ohne Rabatt, \nMWST und Skonto)","Offertöffnung","CHF\n(ohne Rabatt, \nMWST und Skonto)","CHF\n(sans rabais, TVA ni escompte)","CHF\n(senza ribasso, \nIVA e sconto)"]
["Ra-batt","Offertöffnung","Ra-batt","Ra-bais","Ribas-so"]
["Skonto","Offertöffnung","Skonto","Escompte","Sconto"]
["% / Tage","Offertöffnung","% / Tage","% / jours","% / giorni"]
["Bemerkungen","Offertöffnung","Bemerkungen","Remarques","Osservazioni"]
["z.B. Variantenbezeichnung","Offertöffnung","z.B. Variantenbezeichnung","Par ex. désignation des variantes","p.e. designazione delle varianti"]
["Ort, Datum und Unterschriften","Offertöffnung","Ort, Datum und Unterschriften","Lieu, date et signatures","Luogo, data e firme"]
[]
[{"$f":"IF($A$1=\"deutsch\",C111,IF($A$1=\"français\",D111,IF($A$1=\"italiano\",E111)))","v":"Nr."},"Formelle Prüfung","Nr.","N°","N°"]
["Wesentliche Formfehler","Formelle Prüfung","Wesentliche Formfehler","Vices de forme grave","Errori formali rilevanti"]
["Anbieter (Nr. gemäss Offertöffnungprotokoll)","Formelle Prüfung","Anbieter (Nr. gemäss Offertöffnungprotokoll)","Soumissionnaire (n° selon le PV d'ouverture des offres)","Offerente (n° secondo verbale d'apertura offerte)"]
["Das Angebot wurde rechtzeitig eingereicht \n(siehe Offertöffnungsprotokoll)","Formelle Prüfung","Das Angebot wurde rechtzeitig eingereicht \n(siehe Offertöffnungsprotokoll)","L'offre a été soumise dans les délais (cf. PV d'ouverture des offres)","L'offerta è stata inoltrata nei termini previsti\n(cfr. verbale d'apertura offerte)"]
["Es gibt keine unerlaubte Veränderung (z.B. Streichung, Ergänzung etc.) der Angebotsunterlagen","Formelle Prüfung","Es gibt keine unerlaubte Veränderung (z.B. Streichung, Ergänzung etc.) der Angebotsunterlagen","Pas de modification illicite (suppression, complément, etc.) des documents de l'appel d'offres","Non c'è nessuna modifica illecita (p.e. cancellature, aggiunte, ecc.) della documentazione d'offerta"]
["Es gibt keine unerlaubte Veränderung (z.B. Streichung, Ergänzung etc.) des Vertragsentwurfs","Formelle Prüfung","Es gibt keine unerlaubte Veränderung (z.B. Streichung, Ergänzung etc.) des Vertragsentwurfs","Pas de modification illicite (suppression, complément, etc.) du projet de contrat","Non c'è nessuna modifica illecita (p.e. cancellature, aggiunte, ecc.) della bozza di progetto"]
["Es wurden alle im Pflichtenheft verlangten Unterlagen eingereicht","Formelle Prüfung","Es wurden alle im Pflichtenheft verlangten Unterlagen eingereicht","Tous les documents exigés par le cahier des charges ont été présentés","Tutti gli incarti richiesti nel capitolato d'oneri sono stati presentati"]
["Es gibt keine unerlaubten Vorbehalte zum Angebot ","Formelle Prüfung","Es gibt keine unerlaubten Vorbehalte zum Angebot ","Pas de réserve illicite concernant l'offre","Non ci sono riserve illecite verso l'offerta "]
["Weiterbearbeitung (ja/nein)","Formelle Prüfung","Weiterbearbeitung (ja/nein)","Poursuite du traitement (oui/non)","Postelaborazione (sì/no)"]
["Bemerkungen zur Bewertung","Formelle Prüfung","Bemerkungen zur Bewertung","Remarques concernant l'évaluation.","Osservazioni sulla valutazione"]
["Anbieter","Formelle Prüfung","Anbieter","Soumissionnaire","Offerente"]
["Begründung","Formelle Prüfung","Begründung","Justification","Giustificazione"]
[]
[{"$f":"IF($A$1=\"deutsch\",C124,IF($A$1=\"français\",D124,IF($A$1=\"italiano\",E124)))","v":"Eignungskriterien\n(gemäss Ausschreibung)"},"Eignung","Eignungskriterien\n(gemäss Ausschreibung)","Critères de qualification\n(selon l'appel d'offres)","Criteri d'idoneità\n(secondo messa a concorso)"]
["Anbieter (Nr. gemäss Offertöffnungprotokoll)","Eignung","Anbieter (Nr. gemäss Offertöffnungprotokoll)","Soumissionnaire (n° selon le PV d'ouverture des offres)","Offerente (n° secondo verbale d'apertura offerte)"]
["Eignungskriterien erfüllt (ja/nein)","Eignung","Eignungskriterien erfüllt (ja/nein)","Critères de qualification remplis (oui/non)","Criteri d'idoneità soddisfatti (sì/no)"]
["Nr.","Zuschlag","Nr.","N°","N°"]
["Zuschlagskriterien","Zuschlag","Zuschlagskriterien","Critères d'adjudication","Criteri di aggiudicazione"]
["(gemäss Ausschreibung)","Zuschlag","(gemäss Ausschreibung)","(selon l'appel d'offres)","(secondo messa a concorso)"]
["Nachweis","Zuschlag","Nachweis","Preuve","Prova"]
["Ge-\nwicht (%)","Zuschlag","Ge-\nwicht (%)","Pondéra-\ntion (%)","Peso (%)"]
["G","Zuschlag","G","P","P"]
["Pkt.","Zuschlag","Pkt.","pt.","P.to"]
["G * Pkt.","Zuschlag","G * Pkt.","P * pt.","P * P.to"]
["Total, max. 500 Punkte","Zuschlag","Total, max. 500 Punkte","Total, max. 500 points","Totale, max. 500 punti"]
["Bewertungsskala:","Zuschlag","Bewertungsskala:","Echelle d'évaluation:","Scala di valutazione:"]
["Nicht beurteilbar","Zuschlag","Nicht beurteilbar","Ne peut être évalué","Non valutabile"]
["Sehr schlechte Erfüllung","Zuschlag","Sehr schlechte Erfüllung","Très insuffisant","Molto basso"]
["Ungenügende Erfüllung","Zuschlag","Ungenügende Erfüllung","Insuffisant","Basso"]
["Genügende Erfüllung","Zuschlag","Genügende Erfüllung","Suffisant","Medio"]
["Gute Erfüllung","Zuschlag","Gute Erfüllung","Elevé","Elevato"]
["Sehr gute Erfüllung","Zuschlag","Sehr gute Erfüllung","Très élevé","Molto elevato"]
["Zusammenzug aus Subkriterien:","Zuschlag","Zusammenzug aus Subkriterien:","Résumé des sous-critères:","Riassunto dei sottocriteri:"]
["Bemerkungen zur Bewertung","Zuschlag","Bemerkungen zur Bewertung","Remarques concernant l'évaluation","Osservazioni sulla valutazione"]
[]
[{"$f":"IF($A$1=\"deutsch\",C146,IF($A$1=\"français\",D146,IF($A$1=\"italiano\",E146)))","v":"ungenügend"},"Gesamt","ungenügend","insuffisant","insufficiente"]
[{"$f":"IF($A$1=\"deutsch\",C147,IF($A$1=\"français\",D147,IF($A$1=\"italiano\",E147)))","v":", ungenügend"},"Gesamt",", ungenügend",", insuffisant",", insufficiente"]
[{"$f":"IF($A$1=\"deutsch\",C148,IF($A$1=\"français\",D148,IF($A$1=\"italiano\",E148)))","v":"Anbieter"},"Formelle Prüfung","Anbieter","Soumissionnaire","Offerente"]
[{"$f":"IF($A$1=\"deutsch\",C149,IF($A$1=\"français\",D149,IF($A$1=\"italiano\",E149)))","v":"(Nr. gemäss Offertöffnungprotokoll)"},"Formelle Prüfung","(Nr. gemäss Offertöffnungprotokoll)","(n° selon le PV d'ouverture des offres)","(n° secondo verbale d'apertura offerte)"]
[{"$f":"IF($A$1=\"deutsch\",C150,IF($A$1=\"français\",D150,IF($A$1=\"italiano\",E150)))","v":"Skonto in Vergabesumme berücksichtigen?"},"Kosten","Skonto in Vergabesumme berücksichtigen?","Tenir compte de l'escompte dans le montant de l'adjudication?","Tenere conto dello sconto nell’importo dell’aggunto?"]
[{"$f":"IF($A$1=\"deutsch\",C151,IF($A$1=\"français\",D151,IF($A$1=\"italiano\",E151)))","v":"Eingabesumme brutto exkl. MWST (Offertöffnung)"},"Kosten","Eingabesumme brutto exkl. MWST (Offertöffnung)","Montant brut sans TVA (selon PV d'ouverture des offres)","Importo della domanda lordo, IVA escl. (apertura offerte)"]
[{"$f":"IF($A$1=\"deutsch\",C152,IF($A$1=\"français\",D152,IF($A$1=\"italiano\",E152)))","v":"Allgemeiner Abzug"},"Kosten","Allgemeiner Abzug","Déduction générale","Deduzione generale"]
[{"$f":"IF($A$1=\"deutsch\",C153,IF($A$1=\"français\",D153,IF($A$1=\"italiano\",E153)))","v":"Differenzbetrag nach technischer Bereinigung"},"Kosten","Differenzbetrag nach technischer Bereinigung","Différence après révision technique","Differenza dopo chiarimento tecnico"]
[{"$f":"IF($A$1=\"deutsch\",C154,IF($A$1=\"français\",D154,IF($A$1=\"italiano\",E154)))","v":"Rabatt gem. Angebot"},"Kosten","Rabatt gem. Angebot","Rabais selon l'offre","Ribasso secondo offerta"]
["MWST","Kosten","MWST","TVA","IVA"]
["Skonto","Kosten","Skonto","Escompte","Sconto"]
["Total netto inkl. MWST/Skonto\n(Vergabevergleich)","Kosten","Total netto inkl. MWST/Skonto\n(Vergabevergleich)","Total net TVA/escompte compris\n(comparaison de l'adjudication)","Totale al netto, IVA/sconto incl.\n(confronto delibera)"]
[{"$f":"IF($A$1=\"deutsch\",C158,IF($A$1=\"français\",D158,IF($A$1=\"italiano\",E158)))","v":"Total netto inkl. MWST\n(Vergabevergleich)"},"Kosten","Total netto inkl. MWST\n(Vergabevergleich)","Total net TVA compris\n(comparaison de l'adjudication)","Totale al netto, IVA incl.\n(confronto delibera)"]
["Punkte (Max 500)","Gesamt","Punkte (Max 500)","Points (max. 500)","Punti (max. 500)"]
["Rang","Gesamt","Rang","Rang","Rango"]
["in Prozenten, bezogen auf erreichte Punkte","Gesamt","in Prozenten, bezogen auf erreichte Punkte","En pour-cents par rapport au nombre de points","Percentuale rispetto al numero dei punti"]
["Prüfpunkte","Gesamt","Prüfpunkte","Points à examiner","Punti d'esame "]
["Keine wesentlichen Formfehler","Gesamt","Keine wesentlichen Formfehler","Pas d'erreur importante quant à la forme","Nessun errore formale rilevante"]
["Eignungskriterien erfüllt","Gesamt","Eignungskriterien erfüllt","Critères de qualification remplis","Criteri d'idoneità soddisfatti"]
["Bemerkungen zur Gesamtbewertung","Gesamt","Bemerkungen zur Gesamtbewertung","Remarques concernant l'appréciation globale","Osservazioni sulla valutazione complessiva"]
[]
[{"$f":"IF($A$1=\"deutsch\",C167,IF($A$1=\"français\",D167,IF($A$1=\"italiano\",E167)))","v":"Preisspanne: 100% -"},"Qualität","Preisspanne: 100% -","Fourchette d. prix: 100% -","Margine di prezzo: 100% -"]
["Berechnungsart:",null,"Berechnungsart:","Mode de calcul:","Modo di calcolo:"]
["linear",null,"linear","Fonction linéaire","Funzione lineare"]
["quadratisch",null,"quadratisch","Fonction quadratique","Sistema quadratico"]
["Bei asymptotischer Berechnungsart wird keine Preisspanne benötigt.",null,"Bei asymptotischer Berechnungsart wird keine Preisspanne benötigt.","La fonction quadratique ne nécessite pas de fourchette de prix.","Per il sistema quadratico non c’è bisogno di un margine di prezzo."]
["Preis","Qualität","Preis","Prix","Prezzo"]
[]
[{"$f":"IF($A$1=\"deutsch\",C174,IF($A$1=\"français\",D174,IF($A$1=\"italiano\",E174)))","v":"KBOB-Dokument Nr."},"Titelblatt","KBOB-Dokument Nr.","No Document KBOB","No Documento KBOB"]
[{"$f":"IF($A$1=\"deutsch\",C175,IF($A$1=\"français\",D175,IF($A$1=\"italiano\",E175)))","v":"Version"},"Titelblatt","Version","Version","Versione"]
[]
[{"$f":"IF($A$1=\"deutsch\",C177,IF($A$1=\"français\",D177,IF($A$1=\"italiano\",E177)))","v":"Zuschlag, Diagramm"},null,"Zuschlag, Diagramm","Adjudication, diagramme","Aggiudicazione, diagramma"]
[]
[{"$f":"IF($A$1=\"deutsch\",C179,IF($A$1=\"français\",D179,IF($A$1=\"italiano\",E179)))","v":"Achtung! Zuschlag nicht eindeutig: Mehrfache maximale Punktezahl!"},null,"Achtung! Zuschlag nicht eindeutig: Mehrfache maximale Punktezahl!","Attention! Adjudication pas clair: Nombre maximal de points multiples!","Attenzione! Aggiudicazione non chiaro: numero massimo di punti multipli!"]
[{"$f":"IF($A$1=\"deutsch\",C180,IF($A$1=\"français\",D180,IF($A$1=\"italiano\",E180)))","v":"Nicht eindeutig"},null,"Nicht eindeutig","Pas clair","Non chiaro"]
[]
[{"$f":"IF($A$1=\"deutsch\",C182,IF($A$1=\"français\",D182,IF($A$1=\"italiano\",E182)))","v":"Nur ganze Zahlen"},"Zuschlag","Nur ganze Zahlen","Nombres entiers seulement","Solo numeri interi"]
[]
[{"$f":"IF($A$1=\"deutsch\",C184,IF($A$1=\"français\",D184,IF($A$1=\"italiano\",E184)))","v":"Zuschlagskriterien, Punkte"},"Diagramm","Zuschlagskriterien, Punkte","Critères d'adjudication, points","Criteri di aggiudicazione, punti"]